{"text_format":"1","workbook":"xlsx","n_sheets":26,"sheets":["Lista startowa F4H-P","1","2","3","4","5","6","7","8","9","10","11","12","13","14","15","16","17","18","19","20","21","22","23","24","25"],"not_rendered":{"charts":0,"images":0,"macros":1,"external_links":0,"defined_names":27,"comments":0,"pivot_tables":0},"unopened":[],"bounds":{"document_bytes":16777216,"sheet_cells":100000,"rows_first":2000,"rows_last":500,"rows_between":2000,"halvings":0,"cell_chars":16384,"cell_head_chars":4096},"cells_cut":0,"cells_raw":0,"read":"whole","date_system":"1900"}

{"sheet":"Lista startowa F4H-P","index":0,"n_rows":33,"n_cols":27,"rows_kept":33,"cut":false,"hidden":false,"merged":[[2,5,2,7],[0,5,1,6],[0,7,1,7]]}
["Lista startowa F4H-P",null,null,null,null,"Liczba punktowanych kolejek:",null,2,null,null,null,null,null,null,null,null,null,null,null,null,null,null,null,null,null,null,1]
[null,null,null,null,null,null,null,null,null,null,null,null,null,null,null,null,null,null,null,null,null,null,null,null,null,null,2]
[null,null,null,null,null,"Loty"]
["Lp.","Nr startowy","Imię i Nazwisko","Model","O.\n statyczna","I \nKolejka","II \nKolejka","III\n Kolejka","Wynik\n Lotów","Wynik"]
[1,1,"Pilot 1","Model 1",{"$f":"'1'!$G$33","v":0},{"$f":"'1'!$G$21","v":0},{"$f":"'1'!$K$21","v":0},{"$f":"'1'!$O$21","v":0},{"$f":"'1'!$B$22","v":0},{"$f":"'1'!$O$4","v":0}]
[2,2,"Pilot 2","Model 2",{"$f":"'2'!$G$33","v":0},{"$f":"'2'!$G$21","v":0},{"$f":"'2'!$K$21","v":0},{"$f":"'2'!$O$21","v":0},{"$f":"'2'!$B$22","v":0},{"$f":"'2'!$O$4","v":0}]
[3,3,"Pilot 3","Model 3",{"$f":"'3'!$G$33","v":0},{"$f":"'3'!$G$21","v":0},{"$f":"'3'!$K$21","v":0},{"$f":"'3'!$O$21","v":0},{"$f":"'3'!$B$22","v":0},{"$f":"'3'!$O$4","v":0}]
[4,4,"Pilot 4","Model 4",{"$f":"'4'!$G$33","v":0},{"$f":"'4'!$G$21","v":0},{"$f":"'4'!$K$21","v":0},{"$f":"'4'!$O$21","v":0},{"$f":"'4'!$B$22","v":0},{"$f":"'4'!$O$4","v":0}]
[5,5,"Pilot 5","Model 5",{"$f":"'5'!$G$33","v":0},{"$f":"'5'!$G$21","v":0},{"$f":"'5'!$K$21","v":0},{"$f":"'5'!$O$21","v":0},{"$f":"'5'!$B$22","v":0},{"$f":"'5'!$O$4","v":0}]
[6,6,"Pilot 6","Model 6",{"$f":"'6'!$G$33","v":0},{"$f":"'6'!$G$21","v":0},{"$f":"'6'!$K$21","v":0},{"$f":"'6'!$O$21","v":0},{"$f":"'6'!$B$22","v":0},{"$f":"'6'!$O$4","v":0}]
[7,7,"Pilot 7","Model 7",{"$f":"'7'!$G$33","v":0},{"$f":"'7'!$G$21","v":0},{"$f":"'7'!$K$21","v":0},{"$f":"'7'!$O$21","v":0},{"$f":"'7'!$B$22","v":0},{"$f":"'7'!$O$4","v":0}]
[8,8,"Pilot 8","Model 8",{"$f":"'8'!$G$33","v":0},{"$f":"'8'!$G$21","v":0},{"$f":"'8'!$K$21","v":0},{"$f":"'8'!$O$21","v":0},{"$f":"'8'!$B$22","v":0},{"$f":"'8'!$O$4","v":0}]
[9,9,"Pilot 9","Model 9",{"$f":"'9'!$G$33","v":0},{"$f":"'9'!$G$21","v":0},{"$f":"'9'!$K$21","v":0},{"$f":"'9'!$O$21","v":0},{"$f":"'9'!$B$22","v":0},{"$f":"'9'!$O$4","v":0}]
[10,10,"Pilot 10","Model 10",{"$f":"'10'!$G$33","v":0},{"$f":"'10'!$G$21","v":0},{"$f":"'10'!$K$21","v":0},{"$f":"'10'!$O$21","v":0},{"$f":"'10'!$B$22","v":0},{"$f":"'10'!$O$4","v":0}]
[11,11,"Pilot 11","Model 11",{"$f":"'11'!$G$33","v":0},{"$f":"'11'!$G$21","v":0},{"$f":"'11'!$K$21","v":0},{"$f":"'11'!$O$21","v":0},{"$f":"'11'!$B$22","v":0},{"$f":"'11'!$O$4","v":0}]
[12,12,"Pilot 12","Model 12",{"$f":"'12'!$G$33","v":0},{"$f":"'12'!$G$21","v":0},{"$f":"'12'!$K$21","v":0},{"$f":"'12'!$O$21","v":0},{"$f":"'12'!$B$22","v":0},{"$f":"'12'!$O$4","v":0}]
[13,13,"Pilot 13","Model 13",{"$f":"'13'!$G$33","v":0},{"$f":"'13'!$G$21","v":0},{"$f":"'13'!$K$21","v":0},{"$f":"'13'!$O$21","v":0},{"$f":"'13'!$B$22","v":0},{"$f":"'13'!$O$4","v":0}]
[14,14,"Pilot 14","Model 14",{"$f":"'14'!$G$33","v":0},{"$f":"'14'!$G$21","v":0},{"$f":"'14'!$K$21","v":0},{"$f":"'14'!$O$21","v":0},{"$f":"'14'!$B$22","v":0},{"$f":"'14'!$O$4","v":0}]
[15,15,"Pilot 15","Model 15",{"$f":"'15'!$G$33","v":0},{"$f":"'15'!$G$21","v":0},{"$f":"'15'!$K$21","v":0},{"$f":"'15'!$O$21","v":0},{"$f":"'15'!$B$22","v":0},{"$f":"'15'!$O$4","v":0}]
[16,16,"Pilot 16","Model 16",{"$f":"'16'!$G$33","v":0},{"$f":"'16'!$G$21","v":0},{"$f":"'16'!$K$21","v":0},{"$f":"'16'!$O$21","v":0},{"$f":"'16'!$B$22","v":0},{"$f":"'16'!$O$4","v":0}]
[17,17,"Pilot 17","Model 17",{"$f":"'17'!$G$33","v":0},{"$f":"'17'!$G$21","v":0},{"$f":"'17'!$K$21","v":0},{"$f":"'17'!$O$21","v":0},{"$f":"'17'!$B$22","v":0},{"$f":"'17'!$O$4","v":0}]
[18,18,"Pilot 18","Model 18",{"$f":"'18'!$G$33","v":0},{"$f":"'18'!$G$21","v":0},{"$f":"'18'!$K$21","v":0},{"$f":"'18'!$O$21","v":0},{"$f":"'18'!$B$22","v":0},{"$f":"'18'!$O$4","v":0}]
[19,19,"Pilot 19","Model 19",{"$f":"'19'!$G$33","v":0},{"$f":"'19'!$G$21","v":0},{"$f":"'19'!$K$21","v":0},{"$f":"'19'!$O$21","v":0},{"$f":"'19'!$B$22","v":0},{"$f":"'19'!$O$4","v":0}]
[20,20,"Pilot 20","Model 20",{"$f":"'20'!$G$33","v":0},{"$f":"'20'!$G$21","v":0},{"$f":"'20'!$K$21","v":0},{"$f":"'20'!$O$21","v":0},{"$f":"'20'!$B$22","v":0},{"$f":"'20'!$O$4","v":0}]
[21,21,"Pilot 21","Model 21",{"$f":"'21'!$G$33","v":0},{"$f":"'21'!$G$21","v":0},{"$f":"'21'!$K$21","v":0},{"$f":"'21'!$O$21","v":0},{"$f":"'21'!$B$22","v":0},{"$f":"'21'!$O$4","v":0}]
[22,22,"Pilot 22","Model 22",{"$f":"'22'!$G$33","v":0},{"$f":"'22'!$G$21","v":0},{"$f":"'22'!$K$21","v":0},{"$f":"'22'!$O$21","v":0},{"$f":"'22'!$B$22","v":0},{"$f":"'22'!$O$4","v":0}]
[23,23,"Pilot 23","Model 23",{"$f":"'23'!$G$33","v":0},{"$f":"'23'!$G$21","v":0},{"$f":"'23'!$K$21","v":0},{"$f":"'23'!$O$21","v":0},{"$f":"'23'!$B$22","v":0},{"$f":"'23'!$O$4","v":0}]
[24,24,"Pilot 24","Model 24",{"$f":"'24'!$G$33","v":0},{"$f":"'24'!$G$21","v":0},{"$f":"'24'!$K$21","v":0},{"$f":"'24'!$O$21","v":0},{"$f":"'24'!$B$22","v":0},{"$f":"'24'!$O$4","v":0}]
[25,25,"Pilot 25","Model 25",{"$f":"'25'!$G$33","v":0},{"$f":"'25'!$G$21","v":0},{"$f":"'25'!$K$21","v":0},{"$f":"'25'!$O$21","v":0},{"$f":"'25'!$B$22","v":0},{"$f":"'25'!$O$4","v":0}]
[]
[]
[null,"Uzupełnić białe pola danymi zawodnków "]
[null,"Nieużywane wiersze można skasować po usunięciu ochrony arkusza: Recenzja -> Nie chroń arkusza"]

{"sheet":"1","index":1,"n_rows":33,"n_cols":15,"rows_kept":33,"cut":false,"hidden":false,"merged":[[0,1,0,3],[1,1,1,3],[2,1,2,3],[31,0,31,1],[5,7,5,10],[5,11,5,14],[24,0,24,1],[24,3,24,6],[5,3,5,6],[29,0,29,1],[30,0,30,1],[28,0,28,1],[25,0,25,1],[27,0,27,1],[6,0,6,1],[7,0,7,1],[8,0,8,1],[9,0,9,1],[10,0,10,1],[17,0,17,1],[26,0,26,1],[25,8,25,10],[11,0,11,1],[12,0,12,1],[13,0,13,1],[14,0,14,1],[15,0,15,1],[18,0,18,1],[19,0,19,1]]}
["Nazwisko:",{"$f":"VLOOKUP(1,'Lista startowa F4H-P'!$A$5:$C$29,3,FALSE)","v":"Pilot 1"}]
["Model:",{"$f":"VLOOKUP(1,'Lista startowa F4H-P'!$A$5:$D$29,4,FALSE)","v":"Model 1"}]
["Nr Startowy:",{"$f":"VLOOKUP(1,'Lista startowa F4H-P'!$A$5:$C$29,2,FALSE)","v":1}]
[null,null,null,"S:",{"$f":"G33","v":0},"L1:",{"$f":"G21","v":0},"L2:",{"$f":"K21","v":0},"L3:",{"$f":"O21","v":0},"WL:",{"$f":"B22","v":0},"W:",{"$f":"B22+G33","v":0}]
[]
[null,null,null,"I Kolejka",null,null,null,"II Kolejka",null,null,null,"III Kolejka"]
["Program lotu",null,"K","Sędzia I","Sędzia II","Sędzia III","Wynik","Sędzia I","Sędzia II","Sędzia III","Wynik","Sędzia I","Sędzia II","Sędzia III","Wynik"]
["Start",null,11,null,null,null,{"$f":"$C8*(D8+E8+F8)","v":0},null,null,null,{"$f":"$C8*(H8+I8+J8)","v":0},null,null,null,{"$f":"$C8*(L8+M8+N8)","v":0}]
["Pokaz dowolny",null,7,null,null,null,0,null,null,null,0,null,null,null,0]
["Pokaz dowolny",null,7,null,null,null,0,null,null,null,0,null,null,null,0]
["Pokaz dowolny",null,7,null,null,null,0,null,null,null,0,null,null,null,0]
["Pokaz dowolny",null,7,null,null,null,0,null,null,null,0,null,null,null,0]
["Pokaz dowolny",null,7,null,null,null,0,null,null,null,0,null,null,null,0]
["Pokaz dowolny",null,7,null,null,null,0,null,null,null,0,null,null,null,0]
["Pokaz dowolny",null,7,null,null,null,0,null,null,null,0,null,null,null,0]
["Pokaz dowolny",null,7,null,null,null,0,null,null,null,0,null,null,null,0]
["Podejście do lądowania i lądowanie",null,11,null,null,null,0,null,null,null,0,null,null,null,0]
["Realizm lotu\na) Prezentacja lotu",null,4,null,null,null,{"$f":"$C18*(D18+E18+F18)","v":0},null,null,null,{"$f":"$C18*(H18+I18+J18)","v":0},null,null,null,{"$f":"$C18*(L18+M18+N18)","v":0}]
["b) Prędkość modelu",null,9,null,null,null,{"$f":"$C19*(D19+E19+F19)","v":0},null,null,null,{"$f":"$C19*(H19+I19+J19)","v":0},null,null,null,{"$f":"$C19*(L19+M19+N19)","v":0}]
["c) Płynność lotu",null,9,null,null,null,{"$f":"$C20*(D20+E20+F20)","v":0},null,null,null,{"$f":"$C20*(H20+I20+J20)","v":0},null,null,null,{"$f":"$C20*(L20+M20+N20)","v":0}]
[null,null,null,null,null,null,{"$f":"SUM(G8:G20)","v":0},null,null,null,{"$f":"SUM(K8:K20)","v":0},null,null,null,{"$f":"SUM(O8:O20)","v":0}]
["Wynik lotów:",{"$f":"IF('Lista startowa F4H-P'!H1>1,ROUND(((G21+K21+O21)-MIN(G21,K21,O21))/2,0),G21)","v":0}]
[]
[]
["Ocena statyczna (F4H-P)",null,"K","Ocena statyczna",null,null,null,null,"Bonus:"]
["1. Dokładność odwzorowania w skali",null,null,"Sędzia I","Sędzia II","Sędzia III","Wynik",null,"Model wykonany od podstaw",null,null,0.2]
["Widok z boku ",null,4,null,null,null,{"$f":"$C27*(D27+E27+F27)","v":0}]
["Widok z góry",null,4,null,null,null,0]
["Widok z przodu/tyłu",null,4,null,null,null,0]
["2. Kolorystyka",null,7,null,null,null,0]
["3. Oznakowanie",null,4,null,null,null,0]
["4. Szczegóły",null,2,null,null,null,0]
[null,null,null,null,null,null,{"$f":"ROUND(SUM(G27:G32)*(J25+1),0)","v":0}]

{"sheet":"2","index":2,"n_rows":33,"n_cols":15,"rows_kept":33,"cut":false,"hidden":false,"merged":[[0,1,0,3],[1,1,1,3],[2,1,2,3],[17,0,17,1],[6,0,6,1],[7,0,7,1],[8,0,8,1],[9,0,9,1],[10,0,10,1],[11,0,11,1],[12,0,12,1],[13,0,13,1],[14,0,14,1],[15,0,15,1],[18,0,18,1],[31,0,31,1],[5,7,5,10],[5,11,5,14],[24,0,24,1],[24,3,24,6],[5,3,5,6],[29,0,29,1],[30,0,30,1],[28,0,28,1],[25,0,25,1],[26,0,26,1],[27,0,27,1],[25,8,25,10],[19,0,19,1]]}
["Nazwisko:",{"$f":"VLOOKUP(2,'Lista startowa F4H-P'!$A$5:$C$29,3,FALSE)","v":"Pilot 2"}]
["Model:",{"$f":"VLOOKUP(2,'Lista startowa F4H-P'!$A$5:$D$29,4,FALSE)","v":"Model 2"}]
["Nr Startowy:",{"$f":"VLOOKUP(2,'Lista startowa F4H-P'!$A$5:$C$29,2,FALSE)","v":2}]
[null,null,null,"S:",{"$f":"G33","v":0},"L1:",{"$f":"G21","v":0},"L2:",{"$f":"K21","v":0},"L3:",{"$f":"O21","v":0},"WL:",{"$f":"B22","v":0},"W:",{"$f":"B22+G33","v":0}]
[]
[null,null,null,"I Kolejka",null,null,null,"II Kolejka",null,null,null,"III Kolejka"]
["Program lotu",null,"K","Sędzia I","Sędzia II","Sędzia III","Wynik","Sędzia I","Sędzia II","Sędzia III","Wynik","Sędzia I","Sędzia II","Sędzia III","Wynik"]
["Start",null,11,null,null,null,{"$f":"$C8*(D8+E8+F8)","v":0},null,null,null,{"$f":"$C8*(H8+I8+J8)","v":0},null,null,null,{"$f":"$C8*(L8+M8+N8)","v":0}]
["Pokaz dowolny",null,7,null,null,null,0,null,null,null,0,null,null,null,0]
["Pokaz dowolny",null,7,null,null,null,0,null,null,null,0,null,null,null,0]
["Pokaz dowolny",null,7,null,null,null,0,null,null,null,0,null,null,null,0]
["Pokaz dowolny",null,7,null,null,null,0,null,null,null,0,null,null,null,0]
["Pokaz dowolny",null,7,null,null,null,0,null,null,null,0,null,null,null,0]
["Pokaz dowolny",null,7,null,null,null,0,null,null,null,0,null,null,null,0]
["Pokaz dowolny",null,7,null,null,null,0,null,null,null,0,null,null,null,0]
["Pokaz dowolny",null,7,null,null,null,0,null,null,null,0,null,null,null,0]
["Podejście do lądowania i lądowanie",null,11,null,null,null,0,null,null,null,0,null,null,null,0]
["Realizm lotu\na) Prezentacja lotu",null,4,null,null,null,{"$f":"$C18*(D18+E18+F18)","v":0},null,null,null,{"$f":"$C18*(H18+I18+J18)","v":0},null,null,null,{"$f":"$C18*(L18+M18+N18)","v":0}]
["b) Prędkość modelu",null,9,null,null,null,{"$f":"$C19*(D19+E19+F19)","v":0},null,null,null,{"$f":"$C19*(H19+I19+J19)","v":0},null,null,null,{"$f":"$C19*(L19+M19+N19)","v":0}]
["c) Płynność lotu",null,9,null,null,null,{"$f":"$C20*(D20+E20+F20)","v":0},null,null,null,{"$f":"$C20*(H20+I20+J20)","v":0},null,null,null,{"$f":"$C20*(L20+M20+N20)","v":0}]
[null,null,null,null,null,null,{"$f":"SUM(G8:G20)","v":0},null,null,null,{"$f":"SUM(K8:K20)","v":0},null,null,null,{"$f":"SUM(O8:O20)","v":0}]
["Wynik lotów:",{"$f":"IF('Lista startowa F4H-P'!H1>1,ROUND(((G21+K21+O21)-MIN(G21,K21,O21))/2,0),G21)","v":0}]
[]
[]
["Ocena statyczna (F4H-P)",null,"K","Ocena statyczna",null,null,null,null,"Bonus:"]
["1. Dokładność odwzorowania w skali",null,null,"Sędzia I","Sędzia II","Sędzia III","Wynik",null,"Model wykonany od podstaw",null,null,0.2]
["Widok z boku ",null,4,null,null,null,{"$f":"$C27*(D27+E27+F27)","v":0}]
["Widok z góry",null,4,null,null,null,0]
["Widok z przodu/tyłu",null,4,null,null,null,0]
["2. Kolorystyka",null,7,null,null,null,0]
["3. Oznakowanie",null,4,null,null,null,0]
["4. Szczegóły",null,2,null,null,null,0]
[null,null,null,null,null,null,{"$f":"ROUND(SUM(G27:G32)*(J25+1),0)","v":0}]

{"sheet":"3","index":3,"n_rows":33,"n_cols":15,"rows_kept":33,"cut":false,"hidden":false,"merged":[[0,1,0,3],[1,1,1,3],[2,1,2,3],[31,0,31,1],[5,7,5,10],[5,11,5,14],[24,0,24,1],[24,3,24,6],[5,3,5,6],[29,0,29,1],[30,0,30,1],[28,0,28,1],[25,0,25,1],[27,0,27,1],[6,0,6,1],[7,0,7,1],[8,0,8,1],[9,0,9,1],[10,0,10,1],[17,0,17,1],[26,0,26,1],[25,8,25,10],[11,0,11,1],[12,0,12,1],[13,0,13,1],[14,0,14,1],[15,0,15,1],[18,0,18,1],[19,0,19,1]]}
["Nazwisko:",{"$f":"VLOOKUP(3,'Lista startowa F4H-P'!$A$5:$C$29,3,FALSE)","v":"Pilot 3"}]
["Model:",{"$f":"VLOOKUP(3,'Lista startowa F4H-P'!$A$5:$D$29,4,FALSE)","v":"Model 3"}]
["Nr Startowy:",{"$f":"VLOOKUP(3,'Lista startowa F4H-P'!$A$5:$C$29,2,FALSE)","v":3}]
[null,null,null,"S:",{"$f":"G33","v":0},"L1:",{"$f":"G21","v":0},"L2:",{"$f":"K21","v":0},"L3:",{"$f":"O21","v":0},"WL:",{"$f":"B22","v":0},"W:",{"$f":"B22+G33","v":0}]
[]
[null,null,null,"I Kolejka",null,null,null,"II Kolejka",null,null,null,"III Kolejka"]
["Program lotu",null,"K","Sędzia I","Sędzia II","Sędzia III","Wynik","Sędzia I","Sędzia II","Sędzia III","Wynik","Sędzia I","Sędzia II","Sędzia III","Wynik"]
["Start",null,11,null,null,null,{"$f":"$C8*(D8+E8+F8)","v":0},null,null,null,{"$f":"$C8*(H8+I8+J8)","v":0},null,null,null,{"$f":"$C8*(L8+M8+N8)","v":0}]
["Pokaz dowolny",null,7,null,null,null,0,null,null,null,0,null,null,null,0]
["Pokaz dowolny",null,7,null,null,null,0,null,null,null,0,null,null,null,0]
["Pokaz dowolny",null,7,null,null,null,0,null,null,null,0,null,null,null,0]
["Pokaz dowolny",null,7,null,null,null,0,null,null,null,0,null,null,null,0]
["Pokaz dowolny",null,7,null,null,null,0,null,null,null,0,null,null,null,0]
["Pokaz dowolny",null,7,null,null,null,0,null,null,null,0,null,null,null,0]
["Pokaz dowolny",null,7,null,null,null,0,null,null,null,0,null,null,null,0]
["Pokaz dowolny",null,7,null,null,null,0,null,null,null,0,null,null,null,0]
["Podejście do lądowania i lądowanie",null,11,null,null,null,0,null,null,null,0,null,null,null,0]
["Realizm lotu\na) Prezentacja lotu",null,4,null,null,null,{"$f":"$C18*(D18+E18+F18)","v":0},null,null,null,{"$f":"$C18*(H18+I18+J18)","v":0},null,null,null,{"$f":"$C18*(L18+M18+N18)","v":0}]
["b) Prędkość modelu",null,9,null,null,null,{"$f":"$C19*(D19+E19+F19)","v":0},null,null,null,{"$f":"$C19*(H19+I19+J19)","v":0},null,null,null,{"$f":"$C19*(L19+M19+N19)","v":0}]
["c) Płynność lotu",null,9,null,null,null,{"$f":"$C20*(D20+E20+F20)","v":0},null,null,null,{"$f":"$C20*(H20+I20+J20)","v":0},null,null,null,{"$f":"$C20*(L20+M20+N20)","v":0}]
[null,null,null,null,null,null,{"$f":"SUM(G8:G20)","v":0},null,null,null,{"$f":"SUM(K8:K20)","v":0},null,null,null,{"$f":"SUM(O8:O20)","v":0}]
["Wynik lotów:",{"$f":"IF('Lista startowa F4H-P'!H1>1,ROUND(((G21+K21+O21)-MIN(G21,K21,O21))/2,0),G21)","v":0}]
[]
[]
["Ocena statyczna (F4H-P)",null,"K","Ocena statyczna",null,null,null,null,"Bonus:"]
["1. Dokładność odwzorowania w skali",null,null,"Sędzia I","Sędzia II","Sędzia III","Wynik",null,"Model wykonany od podstaw",null,null,0.2]
["Widok z boku ",null,4,null,null,null,{"$f":"$C27*(D27+E27+F27)","v":0}]
["Widok z góry",null,4,null,null,null,0]
["Widok z przodu/tyłu",null,4,null,null,null,0]
["2. Kolorystyka",null,7,null,null,null,0]
["3. Oznakowanie",null,4,null,null,null,0]
["4. Szczegóły",null,2,null,null,null,0]
[null,null,null,null,null,null,{"$f":"ROUND(SUM(G27:G32)*(J25+1),0)","v":0}]

{"sheet":"4","index":4,"n_rows":33,"n_cols":15,"rows_kept":33,"cut":false,"hidden":false,"merged":[[18,0,18,1],[19,0,19,1],[0,1,0,3],[1,1,1,3],[2,1,2,3],[11,0,11,1],[12,0,12,1],[13,0,13,1],[14,0,14,1],[15,0,15,1],[31,0,31,1],[29,0,29,1],[30,0,30,1],[25,0,25,1],[28,0,28,1],[26,0,26,1],[27,0,27,1],[17,0,17,1],[25,8,25,10],[5,7,5,10],[5,11,5,14],[24,0,24,1],[24,3,24,6],[5,3,5,6],[6,0,6,1],[7,0,7,1],[8,0,8,1],[9,0,9,1],[10,0,10,1]]}
["Nazwisko:",{"$f":"VLOOKUP(4,'Lista startowa F4H-P'!$A$5:$C$29,3,FALSE)","v":"Pilot 4"}]
["Model:",{"$f":"VLOOKUP(4,'Lista startowa F4H-P'!$A$5:$D$29,4,FALSE)","v":"Model 4"}]
["Nr Startowy:",{"$f":"VLOOKUP(4,'Lista startowa F4H-P'!$A$5:$C$29,2,FALSE)","v":4}]
[null,null,null,"S:",{"$f":"G33","v":0},"L1:",{"$f":"G21","v":0},"L2:",{"$f":"K21","v":0},"L3:",{"$f":"O21","v":0},"WL:",{"$f":"B22","v":0},"W:",{"$f":"B22+G33","v":0}]
[]
[null,null,null,"I Kolejka",null,null,null,"II Kolejka",null,null,null,"III Kolejka"]
["Program lotu",null,"K","Sędzia I","Sędzia II","Sędzia III","Wynik","Sędzia I","Sędzia II","Sędzia III","Wynik","Sędzia I","Sędzia II","Sędzia III","Wynik"]
["Start",null,11,null,null,null,{"$f":"$C8*(D8+E8+F8)","v":0},null,null,null,{"$f":"$C8*(H8+I8+J8)","v":0},null,null,null,{"$f":"$C8*(L8+M8+N8)","v":0}]
["Pokaz dowolny",null,7,null,null,null,0,null,null,null,0,null,null,null,0]
["Pokaz dowolny",null,7,null,null,null,0,null,null,null,0,null,null,null,0]
["Pokaz dowolny",null,7,null,null,null,0,null,null,null,0,null,null,null,0]
["Pokaz dowolny",null,7,null,null,null,0,null,null,null,0,null,null,null,0]
["Pokaz dowolny",null,7,null,null,null,0,null,null,null,0,null,null,null,0]
["Pokaz dowolny",null,7,null,null,null,0,null,null,null,0,null,null,null,0]
["Pokaz dowolny",null,7,null,null,null,0,null,null,null,0,null,null,null,0]
["Pokaz dowolny",null,7,null,null,null,0,null,null,null,0,null,null,null,0]
["Podejście do lądowania i lądowanie",null,11,null,null,null,0,null,null,null,0,null,null,null,0]
["Realizm lotu\na) Prezentacja lotu",null,4,null,null,null,{"$f":"$C18*(D18+E18+F18)","v":0},null,null,null,{"$f":"$C18*(H18+I18+J18)","v":0},null,null,null,{"$f":"$C18*(L18+M18+N18)","v":0}]
["b) Prędkość modelu",null,9,null,null,null,{"$f":"$C19*(D19+E19+F19)","v":0},null,null,null,{"$f":"$C19*(H19+I19+J19)","v":0},null,null,null,{"$f":"$C19*(L19+M19+N19)","v":0}]
["c) Płynność lotu",null,9,null,null,null,{"$f":"$C20*(D20+E20+F20)","v":0},null,null,null,{"$f":"$C20*(H20+I20+J20)","v":0},null,null,null,{"$f":"$C20*(L20+M20+N20)","v":0}]
[null,null,null,null,null,null,{"$f":"SUM(G8:G20)","v":0},null,null,null,{"$f":"SUM(K8:K20)","v":0},null,null,null,{"$f":"SUM(O8:O20)","v":0}]
["Wynik lotów:",{"$f":"IF('Lista startowa F4H-P'!H1>1,ROUND(((G21+K21+O21)-MIN(G21,K21,O21))/2,0),G21)","v":0}]
[]
[]
["Ocena statyczna (F4H-P)",null,"K","Ocena statyczna",null,null,null,null,"Bonus:"]
["1. Dokładność odwzorowania w skali",null,null,"Sędzia I","Sędzia II","Sędzia III","Wynik",null,"Model wykonany od podstaw",null,null,0.2]
["Widok z boku ",null,4,null,null,null,{"$f":"$C27*(D27+E27+F27)","v":0}]
["Widok z góry",null,4,null,null,null,0]
["Widok z przodu/tyłu",null,4,null,null,null,0]
["2. Kolorystyka",null,7,null,null,null,0]
["3. Oznakowanie",null,4,null,null,null,0]
["4. Szczegóły",null,2,null,null,null,0]
[null,null,null,null,null,null,{"$f":"ROUND(SUM(G27:G32)*(J25+1),0)","v":0}]

{"sheet":"5","index":5,"n_rows":33,"n_cols":15,"rows_kept":33,"cut":false,"hidden":false,"merged":[[0,1,0,3],[1,1,1,3],[2,1,2,3],[31,0,31,1],[5,7,5,10],[5,11,5,14],[24,0,24,1],[24,3,24,6],[5,3,5,6],[29,0,29,1],[30,0,30,1],[28,0,28,1],[25,0,25,1],[27,0,27,1],[6,0,6,1],[7,0,7,1],[8,0,8,1],[9,0,9,1],[10,0,10,1],[17,0,17,1],[26,0,26,1],[25,8,25,10],[11,0,11,1],[12,0,12,1],[13,0,13,1],[14,0,14,1],[15,0,15,1],[18,0,18,1],[19,0,19,1]]}
["Nazwisko:",{"$f":"VLOOKUP(5,'Lista startowa F4H-P'!$A$5:$C$29,3,FALSE)","v":"Pilot 5"}]
["Model:",{"$f":"VLOOKUP(5,'Lista startowa F4H-P'!$A$5:$D$29,4,FALSE)","v":"Model 5"}]
["Nr Startowy:",{"$f":"VLOOKUP(5,'Lista startowa F4H-P'!$A$5:$C$29,2,FALSE)","v":5}]
[null,null,null,"S:",{"$f":"G33","v":0},"L1:",{"$f":"G21","v":0},"L2:",{"$f":"K21","v":0},"L3:",{"$f":"O21","v":0},"WL:",{"$f":"B22","v":0},"W:",{"$f":"B22+G33","v":0}]
[]
[null,null,null,"I Kolejka",null,null,null,"II Kolejka",null,null,null,"III Kolejka"]
["Program lotu",null,"K","Sędzia I","Sędzia II","Sędzia III","Wynik","Sędzia I","Sędzia II","Sędzia III","Wynik","Sędzia I","Sędzia II","Sędzia III","Wynik"]
["Start",null,11,null,null,null,{"$f":"$C8*(D8+E8+F8)","v":0},null,null,null,{"$f":"$C8*(H8+I8+J8)","v":0},null,null,null,{"$f":"$C8*(L8+M8+N8)","v":0}]
["Pokaz dowolny",null,7,null,null,null,0,null,null,null,0,null,null,null,0]
["Pokaz dowolny",null,7,null,null,null,0,null,null,null,0,null,null,null,0]
["Pokaz dowolny",null,7,null,null,null,0,null,null,null,0,null,null,null,0]
["Pokaz dowolny",null,7,null,null,null,0,null,null,null,0,null,null,null,0]
["Pokaz dowolny",null,7,null,null,null,0,null,null,null,0,null,null,null,0]
["Pokaz dowolny",null,7,null,null,null,0,null,null,null,0,null,null,null,0]
["Pokaz dowolny",null,7,null,null,null,0,null,null,null,0,null,null,null,0]
["Pokaz dowolny",null,7,null,null,null,0,null,null,null,0,null,null,null,0]
["Podejście do lądowania i lądowanie",null,11,null,null,null,0,null,null,null,0,null,null,null,0]
["Realizm lotu\na) Prezentacja lotu",null,4,null,null,null,{"$f":"$C18*(D18+E18+F18)","v":0},null,null,null,{"$f":"$C18*(H18+I18+J18)","v":0},null,null,null,{"$f":"$C18*(L18+M18+N18)","v":0}]
["b) Prędkość modelu",null,9,null,null,null,{"$f":"$C19*(D19+E19+F19)","v":0},null,null,null,{"$f":"$C19*(H19+I19+J19)","v":0},null,null,null,{"$f":"$C19*(L19+M19+N19)","v":0}]
["c) Płynność lotu",null,9,null,null,null,{"$f":"$C20*(D20+E20+F20)","v":0},null,null,null,{"$f":"$C20*(H20+I20+J20)","v":0},null,null,null,{"$f":"$C20*(L20+M20+N20)","v":0}]
[null,null,null,null,null,null,{"$f":"SUM(G8:G20)","v":0},null,null,null,{"$f":"SUM(K8:K20)","v":0},null,null,null,{"$f":"SUM(O8:O20)","v":0}]
["Wynik lotów:",{"$f":"IF('Lista startowa F4H-P'!H1>1,ROUND(((G21+K21+O21)-MIN(G21,K21,O21))/2,0),G21)","v":0}]
[]
[]
["Ocena statyczna (F4H-P)",null,"K","Ocena statyczna",null,null,null,null,"Bonus:"]
["1. Dokładność odwzorowania w skali",null,null,"Sędzia I","Sędzia II","Sędzia III","Wynik",null,"Model wykonany od podstaw",null,null,0.2]
["Widok z boku ",null,4,null,null,null,{"$f":"$C27*(D27+E27+F27)","v":0}]
["Widok z góry",null,4,null,null,null,0]
["Widok z przodu/tyłu",null,4,null,null,null,0]
["2. Kolorystyka",null,7,null,null,null,0]
["3. Oznakowanie",null,4,null,null,null,0]
["4. Szczegóły",null,2,null,null,null,0]
[null,null,null,null,null,null,{"$f":"ROUND(SUM(G27:G32)*(J25+1),0)","v":0}]

{"sheet":"6","index":6,"n_rows":33,"n_cols":15,"rows_kept":33,"cut":false,"hidden":false,"merged":[[18,0,18,1],[19,0,19,1],[0,1,0,3],[1,1,1,3],[2,1,2,3],[11,0,11,1],[12,0,12,1],[13,0,13,1],[14,0,14,1],[15,0,15,1],[31,0,31,1],[29,0,29,1],[30,0,30,1],[25,0,25,1],[28,0,28,1],[26,0,26,1],[27,0,27,1],[17,0,17,1],[25,8,25,10],[5,7,5,10],[5,11,5,14],[24,0,24,1],[24,3,24,6],[5,3,5,6],[6,0,6,1],[7,0,7,1],[8,0,8,1],[9,0,9,1],[10,0,10,1]]}
["Nazwisko:",{"$f":"VLOOKUP(6,'Lista startowa F4H-P'!$A$5:$C$29,3,FALSE)","v":"Pilot 6"}]
["Model:",{"$f":"VLOOKUP(6,'Lista startowa F4H-P'!$A$5:$D$29,4,FALSE)","v":"Model 6"}]
["Nr Startowy:",{"$f":"VLOOKUP(6,'Lista startowa F4H-P'!$A$5:$C$29,2,FALSE)","v":6}]
[null,null,null,"S:",{"$f":"G33","v":0},"L1:",{"$f":"G21","v":0},"L2:",{"$f":"K21","v":0},"L3:",{"$f":"O21","v":0},"WL:",{"$f":"B22","v":0},"W:",{"$f":"B22+G33","v":0}]
[]
[null,null,null,"I Kolejka",null,null,null,"II Kolejka",null,null,null,"III Kolejka"]
["Program lotu",null,"K","Sędzia I","Sędzia II","Sędzia III","Wynik","Sędzia I","Sędzia II","Sędzia III","Wynik","Sędzia I","Sędzia II","Sędzia III","Wynik"]
["Start",null,11,null,null,null,{"$f":"$C8*(D8+E8+F8)","v":0},null,null,null,{"$f":"$C8*(H8+I8+J8)","v":0},null,null,null,{"$f":"$C8*(L8+M8+N8)","v":0}]
["Pokaz dowolny",null,7,null,null,null,0,null,null,null,0,null,null,null,0]
["Pokaz dowolny",null,7,null,null,null,0,null,null,null,0,null,null,null,0]
["Pokaz dowolny",null,7,null,null,null,0,null,null,null,0,null,null,null,0]
["Pokaz dowolny",null,7,null,null,null,0,null,null,null,0,null,null,null,0]
["Pokaz dowolny",null,7,null,null,null,0,null,null,null,0,null,null,null,0]
["Pokaz dowolny",null,7,null,null,null,0,null,null,null,0,null,null,null,0]
["Pokaz dowolny",null,7,null,null,null,0,null,null,null,0,null,null,null,0]
["Pokaz dowolny",null,7,null,null,null,0,null,null,null,0,null,null,null,0]
["Podejście do lądowania i lądowanie",null,11,null,null,null,0,null,null,null,0,null,null,null,0]
["Realizm lotu\na) Prezentacja lotu",null,4,null,null,null,{"$f":"$C18*(D18+E18+F18)","v":0},null,null,null,{"$f":"$C18*(H18+I18+J18)","v":0},null,null,null,{"$f":"$C18*(L18+M18+N18)","v":0}]
["b) Prędkość modelu",null,9,null,null,null,{"$f":"$C19*(D19+E19+F19)","v":0},null,null,null,{"$f":"$C19*(H19+I19+J19)","v":0},null,null,null,{"$f":"$C19*(L19+M19+N19)","v":0}]
["c) Płynność lotu",null,9,null,null,null,{"$f":"$C20*(D20+E20+F20)","v":0},null,null,null,{"$f":"$C20*(H20+I20+J20)","v":0},null,null,null,{"$f":"$C20*(L20+M20+N20)","v":0}]
[null,null,null,null,null,null,{"$f":"SUM(G8:G20)","v":0},null,null,null,{"$f":"SUM(K8:K20)","v":0},null,null,null,{"$f":"SUM(O8:O20)","v":0}]
["Wynik lotów:",{"$f":"IF('Lista startowa F4H-P'!H1>1,ROUND(((G21+K21+O21)-MIN(G21,K21,O21))/2,0),G21)","v":0}]
[]
[]
["Ocena statyczna (F4H-P)",null,"K","Ocena statyczna",null,null,null,null,"Bonus:"]
["1. Dokładność odwzorowania w skali",null,null,"Sędzia I","Sędzia II","Sędzia III","Wynik",null,"Model wykonany od podstaw",null,null,0.2]
["Widok z boku ",null,4,null,null,null,{"$f":"$C27*(D27+E27+F27)","v":0}]
["Widok z góry",null,4,null,null,null,0]
["Widok z przodu/tyłu",null,4,null,null,null,0]
["2. Kolorystyka",null,7,null,null,null,0]
["3. Oznakowanie",null,4,null,null,null,0]
["4. Szczegóły",null,2,null,null,null,0]
[null,null,null,null,null,null,{"$f":"ROUND(SUM(G27:G32)*(J25+1),0)","v":0}]

{"sheet":"7","index":7,"n_rows":33,"n_cols":15,"rows_kept":33,"cut":false,"hidden":false,"merged":[[0,1,0,3],[1,1,1,3],[2,1,2,3],[31,0,31,1],[5,7,5,10],[5,11,5,14],[24,0,24,1],[24,3,24,6],[5,3,5,6],[29,0,29,1],[30,0,30,1],[28,0,28,1],[25,0,25,1],[27,0,27,1],[6,0,6,1],[7,0,7,1],[8,0,8,1],[9,0,9,1],[10,0,10,1],[17,0,17,1],[26,0,26,1],[25,8,25,10],[11,0,11,1],[12,0,12,1],[13,0,13,1],[14,0,14,1],[15,0,15,1],[18,0,18,1],[19,0,19,1]]}
["Nazwisko:",{"$f":"VLOOKUP(7,'Lista startowa F4H-P'!$A$5:$C$29,3,FALSE)","v":"Pilot 7"}]
["Model:",{"$f":"VLOOKUP(7,'Lista startowa F4H-P'!$A$5:$D$29,4,FALSE)","v":"Model 7"}]
["Nr Startowy:",{"$f":"VLOOKUP(7,'Lista startowa F4H-P'!$A$5:$C$29,2,FALSE)","v":7}]
[null,null,null,"S:",{"$f":"G33","v":0},"L1:",{"$f":"G21","v":0},"L2:",{"$f":"K21","v":0},"L3:",{"$f":"O21","v":0},"WL:",{"$f":"B22","v":0},"W:",{"$f":"B22+G33","v":0}]
[]
[null,null,null,"I Kolejka",null,null,null,"II Kolejka",null,null,null,"III Kolejka"]
["Program lotu",null,"K","Sędzia I","Sędzia II","Sędzia III","Wynik","Sędzia I","Sędzia II","Sędzia III","Wynik","Sędzia I","Sędzia II","Sędzia III","Wynik"]
["Start",null,11,null,null,null,{"$f":"$C8*(D8+E8+F8)","v":0},null,null,null,{"$f":"$C8*(H8+I8+J8)","v":0},null,null,null,{"$f":"$C8*(L8+M8+N8)","v":0}]
["Pokaz dowolny",null,7,null,null,null,0,null,null,null,0,null,null,null,0]
["Pokaz dowolny",null,7,null,null,null,0,null,null,null,0,null,null,null,0]
["Pokaz dowolny",null,7,null,null,null,0,null,null,null,0,null,null,null,0]
["Pokaz dowolny",null,7,null,null,null,0,null,null,null,0,null,null,null,0]
["Pokaz dowolny",null,7,null,null,null,0,null,null,null,0,null,null,null,0]
["Pokaz dowolny",null,7,null,null,null,0,null,null,null,0,null,null,null,0]
["Pokaz dowolny",null,7,null,null,null,0,null,null,null,0,null,null,null,0]
["Pokaz dowolny",null,7,null,null,null,0,null,null,null,0,null,null,null,0]
["Podejście do lądowania i lądowanie",null,11,null,null,null,0,null,null,null,0,null,null,null,0]
["Realizm lotu\na) Prezentacja lotu",null,4,null,null,null,{"$f":"$C18*(D18+E18+F18)","v":0},null,null,null,{"$f":"$C18*(H18+I18+J18)","v":0},null,null,null,{"$f":"$C18*(L18+M18+N18)","v":0}]
["b) Prędkość modelu",null,9,null,null,null,{"$f":"$C19*(D19+E19+F19)","v":0},null,null,null,{"$f":"$C19*(H19+I19+J19)","v":0},null,null,null,{"$f":"$C19*(L19+M19+N19)","v":0}]
["c) Płynność lotu",null,9,null,null,null,{"$f":"$C20*(D20+E20+F20)","v":0},null,null,null,{"$f":"$C20*(H20+I20+J20)","v":0},null,null,null,{"$f":"$C20*(L20+M20+N20)","v":0}]
[null,null,null,null,null,null,{"$f":"SUM(G8:G20)","v":0},null,null,null,{"$f":"SUM(K8:K20)","v":0},null,null,null,{"$f":"SUM(O8:O20)","v":0}]
["Wynik lotów:",{"$f":"IF('Lista startowa F4H-P'!H1>1,ROUND(((G21+K21+O21)-MIN(G21,K21,O21))/2,0),G21)","v":0}]
[]
[]
["Ocena statyczna (F4H-P)",null,"K","Ocena statyczna",null,null,null,null,"Bonus:"]
["1. Dokładność odwzorowania w skali",null,null,"Sędzia I","Sędzia II","Sędzia III","Wynik",null,"Model wykonany od podstaw",null,null,0.2]
["Widok z boku ",null,4,null,null,null,{"$f":"$C27*(D27+E27+F27)","v":0}]
["Widok z góry",null,4,null,null,null,0]
["Widok z przodu/tyłu",null,4,null,null,null,0]
["2. Kolorystyka",null,7,null,null,null,0]
["3. Oznakowanie",null,4,null,null,null,0]
["4. Szczegóły",null,2,null,null,null,0]
[null,null,null,null,null,null,{"$f":"ROUND(SUM(G27:G32)*(J25+1),0)","v":0}]

{"sheet":"8","index":8,"n_rows":33,"n_cols":15,"rows_kept":33,"cut":false,"hidden":false,"merged":[[18,0,18,1],[19,0,19,1],[0,1,0,3],[1,1,1,3],[2,1,2,3],[11,0,11,1],[12,0,12,1],[13,0,13,1],[14,0,14,1],[15,0,15,1],[31,0,31,1],[29,0,29,1],[30,0,30,1],[25,0,25,1],[28,0,28,1],[26,0,26,1],[27,0,27,1],[17,0,17,1],[25,8,25,10],[5,7,5,10],[5,11,5,14],[24,0,24,1],[24,3,24,6],[5,3,5,6],[6,0,6,1],[7,0,7,1],[8,0,8,1],[9,0,9,1],[10,0,10,1]]}
["Nazwisko:",{"$f":"VLOOKUP(8,'Lista startowa F4H-P'!$A$5:$C$29,3,FALSE)","v":"Pilot 8"}]
["Model:",{"$f":"VLOOKUP(8,'Lista startowa F4H-P'!$A$5:$D$29,4,FALSE)","v":"Model 8"}]
["Nr Startowy:",{"$f":"VLOOKUP(8,'Lista startowa F4H-P'!$A$5:$C$29,2,FALSE)","v":8}]
[null,null,null,"S:",{"$f":"G33","v":0},"L1:",{"$f":"G21","v":0},"L2:",{"$f":"K21","v":0},"L3:",{"$f":"O21","v":0},"WL:",{"$f":"B22","v":0},"W:",{"$f":"B22+G33","v":0}]
[]
[null,null,null,"I Kolejka",null,null,null,"II Kolejka",null,null,null,"III Kolejka"]
["Program lotu",null,"K","Sędzia I","Sędzia II","Sędzia III","Wynik","Sędzia I","Sędzia II","Sędzia III","Wynik","Sędzia I","Sędzia II","Sędzia III","Wynik"]
["Start",null,11,null,null,null,{"$f":"$C8*(D8+E8+F8)","v":0},null,null,null,{"$f":"$C8*(H8+I8+J8)","v":0},null,null,null,{"$f":"$C8*(L8+M8+N8)","v":0}]
["Pokaz dowolny",null,7,null,null,null,0,null,null,null,0,null,null,null,0]
["Pokaz dowolny",null,7,null,null,null,0,null,null,null,0,null,null,null,0]
["Pokaz dowolny",null,7,null,null,null,0,null,null,null,0,null,null,null,0]
["Pokaz dowolny",null,7,null,null,null,0,null,null,null,0,null,null,null,0]
["Pokaz dowolny",null,7,null,null,null,0,null,null,null,0,null,null,null,0]
["Pokaz dowolny",null,7,null,null,null,0,null,null,null,0,null,null,null,0]
["Pokaz dowolny",null,7,null,null,null,0,null,null,null,0,null,null,null,0]
["Pokaz dowolny",null,7,null,null,null,0,null,null,null,0,null,null,null,0]
["Podejście do lądowania i lądowanie",null,11,null,null,null,0,null,null,null,0,null,null,null,0]
["Realizm lotu\na) Prezentacja lotu",null,4,null,null,null,{"$f":"$C18*(D18+E18+F18)","v":0},null,null,null,{"$f":"$C18*(H18+I18+J18)","v":0},null,null,null,{"$f":"$C18*(L18+M18+N18)","v":0}]
["b) Prędkość modelu",null,9,null,null,null,{"$f":"$C19*(D19+E19+F19)","v":0},null,null,null,{"$f":"$C19*(H19+I19+J19)","v":0},null,null,null,{"$f":"$C19*(L19+M19+N19)","v":0}]
["c) Płynność lotu",null,9,null,null,null,{"$f":"$C20*(D20+E20+F20)","v":0},null,null,null,{"$f":"$C20*(H20+I20+J20)","v":0},null,null,null,{"$f":"$C20*(L20+M20+N20)","v":0}]
[null,null,null,null,null,null,{"$f":"SUM(G8:G20)","v":0},null,null,null,{"$f":"SUM(K8:K20)","v":0},null,null,null,{"$f":"SUM(O8:O20)","v":0}]
["Wynik lotów:",{"$f":"IF('Lista startowa F4H-P'!H1>1,ROUND(((G21+K21+O21)-MIN(G21,K21,O21))/2,0),G21)","v":0}]
[]
[]
["Ocena statyczna (F4H-P)",null,"K","Ocena statyczna",null,null,null,null,"Bonus:"]
["1. Dokładność odwzorowania w skali",null,null,"Sędzia I","Sędzia II","Sędzia III","Wynik",null,"Model wykonany od podstaw",null,null,0.2]
["Widok z boku ",null,4,null,null,null,{"$f":"$C27*(D27+E27+F27)","v":0}]
["Widok z góry",null,4,null,null,null,0]
["Widok z przodu/tyłu",null,4,null,null,null,0]
["2. Kolorystyka",null,7,null,null,null,0]
["3. Oznakowanie",null,4,null,null,null,0]
["4. Szczegóły",null,2,null,null,null,0]
[null,null,null,null,null,null,{"$f":"ROUND(SUM(G27:G32)*(J25+1),0)","v":0}]

{"sheet":"9","index":9,"n_rows":33,"n_cols":15,"rows_kept":33,"cut":false,"hidden":false,"merged":[[0,1,0,3],[1,1,1,3],[2,1,2,3],[31,0,31,1],[5,7,5,10],[5,11,5,14],[24,0,24,1],[24,3,24,6],[5,3,5,6],[29,0,29,1],[30,0,30,1],[28,0,28,1],[25,0,25,1],[27,0,27,1],[6,0,6,1],[7,0,7,1],[8,0,8,1],[9,0,9,1],[10,0,10,1],[17,0,17,1],[26,0,26,1],[25,8,25,10],[11,0,11,1],[12,0,12,1],[13,0,13,1],[14,0,14,1],[15,0,15,1],[18,0,18,1],[19,0,19,1]]}
["Nazwisko:",{"$f":"VLOOKUP(9,'Lista startowa F4H-P'!$A$5:$C$29,3,FALSE)","v":"Pilot 9"}]
["Model:",{"$f":"VLOOKUP(9,'Lista startowa F4H-P'!$A$5:$D$29,4,FALSE)","v":"Model 9"}]
["Nr Startowy:",{"$f":"VLOOKUP(9,'Lista startowa F4H-P'!$A$5:$C$29,2,FALSE)","v":9}]
[null,null,null,"S:",{"$f":"G33","v":0},"L1:",{"$f":"G21","v":0},"L2:",{"$f":"K21","v":0},"L3:",{"$f":"O21","v":0},"WL:",{"$f":"B22","v":0},"W:",{"$f":"B22+G33","v":0}]
[]
[null,null,null,"I Kolejka",null,null,null,"II Kolejka",null,null,null,"III Kolejka"]
["Program lotu",null,"K","Sędzia I","Sędzia II","Sędzia III","Wynik","Sędzia I","Sędzia II","Sędzia III","Wynik","Sędzia I","Sędzia II","Sędzia III","Wynik"]
["Start",null,11,null,null,null,{"$f":"$C8*(D8+E8+F8)","v":0},null,null,null,{"$f":"$C8*(H8+I8+J8)","v":0},null,null,null,{"$f":"$C8*(L8+M8+N8)","v":0}]
["Pokaz dowolny",null,7,null,null,null,0,null,null,null,0,null,null,null,0]
["Pokaz dowolny",null,7,null,null,null,0,null,null,null,0,null,null,null,0]
["Pokaz dowolny",null,7,null,null,null,0,null,null,null,0,null,null,null,0]
["Pokaz dowolny",null,7,null,null,null,0,null,null,null,0,null,null,null,0]
["Pokaz dowolny",null,7,null,null,null,0,null,null,null,0,null,null,null,0]
["Pokaz dowolny",null,7,null,null,null,0,null,null,null,0,null,null,null,0]
["Pokaz dowolny",null,7,null,null,null,0,null,null,null,0,null,null,null,0]
["Pokaz dowolny",null,7,null,null,null,0,null,null,null,0,null,null,null,0]
["Podejście do lądowania i lądowanie",null,11,null,null,null,0,null,null,null,0,null,null,null,0]
["Realizm lotu\na) Prezentacja lotu",null,4,null,null,null,{"$f":"$C18*(D18+E18+F18)","v":0},null,null,null,{"$f":"$C18*(H18+I18+J18)","v":0},null,null,null,{"$f":"$C18*(L18+M18+N18)","v":0}]
["b) Prędkość modelu",null,9,null,null,null,{"$f":"$C19*(D19+E19+F19)","v":0},null,null,null,{"$f":"$C19*(H19+I19+J19)","v":0},null,null,null,{"$f":"$C19*(L19+M19+N19)","v":0}]
["c) Płynność lotu",null,9,null,null,null,{"$f":"$C20*(D20+E20+F20)","v":0},null,null,null,{"$f":"$C20*(H20+I20+J20)","v":0},null,null,null,{"$f":"$C20*(L20+M20+N20)","v":0}]
[null,null,null,null,null,null,{"$f":"SUM(G8:G20)","v":0},null,null,null,{"$f":"SUM(K8:K20)","v":0},null,null,null,{"$f":"SUM(O8:O20)","v":0}]
["Wynik lotów:",{"$f":"IF('Lista startowa F4H-P'!H1>1,ROUND(((G21+K21+O21)-MIN(G21,K21,O21))/2,0),G21)","v":0}]
[]
[]
["Ocena statyczna (F4H-P)",null,"K","Ocena statyczna",null,null,null,null,"Bonus:"]
["1. Dokładność odwzorowania w skali",null,null,"Sędzia I","Sędzia II","Sędzia III","Wynik",null,"Model wykonany od podstaw",null,null,0.2]
["Widok z boku ",null,4,null,null,null,{"$f":"$C27*(D27+E27+F27)","v":0}]
["Widok z góry",null,4,null,null,null,0]
["Widok z przodu/tyłu",null,4,null,null,null,0]
["2. Kolorystyka",null,7,null,null,null,0]
["3. Oznakowanie",null,4,null,null,null,0]
["4. Szczegóły",null,2,null,null,null,0]
[null,null,null,null,null,null,{"$f":"ROUND(SUM(G27:G32)*(J25+1),0)","v":0}]

{"sheet":"10","index":10,"n_rows":33,"n_cols":15,"rows_kept":33,"cut":false,"hidden":false,"merged":[[18,0,18,1],[19,0,19,1],[0,1,0,3],[1,1,1,3],[2,1,2,3],[11,0,11,1],[12,0,12,1],[13,0,13,1],[14,0,14,1],[15,0,15,1],[31,0,31,1],[29,0,29,1],[30,0,30,1],[25,0,25,1],[28,0,28,1],[26,0,26,1],[27,0,27,1],[17,0,17,1],[25,8,25,10],[5,7,5,10],[5,11,5,14],[24,0,24,1],[24,3,24,6],[5,3,5,6],[6,0,6,1],[7,0,7,1],[8,0,8,1],[9,0,9,1],[10,0,10,1]]}
["Nazwisko:",{"$f":"VLOOKUP(10,'Lista startowa F4H-P'!$A$5:$C$29,3,FALSE)","v":"Pilot 10"}]
["Model:",{"$f":"VLOOKUP(10,'Lista startowa F4H-P'!$A$5:$D$29,4,FALSE)","v":"Model 10"}]
["Nr Startowy:",{"$f":"VLOOKUP(10,'Lista startowa F4H-P'!$A$5:$C$29,2,FALSE)","v":10}]
[null,null,null,"S:",{"$f":"G33","v":0},"L1:",{"$f":"G21","v":0},"L2:",{"$f":"K21","v":0},"L3:",{"$f":"O21","v":0},"WL:",{"$f":"B22","v":0},"W:",{"$f":"B22+G33","v":0}]
[]
[null,null,null,"I Kolejka",null,null,null,"II Kolejka",null,null,null,"III Kolejka"]
["Program lotu",null,"K","Sędzia I","Sędzia II","Sędzia III","Wynik","Sędzia I","Sędzia II","Sędzia III","Wynik","Sędzia I","Sędzia II","Sędzia III","Wynik"]
["Start",null,11,null,null,null,{"$f":"$C8*(D8+E8+F8)","v":0},null,null,null,{"$f":"$C8*(H8+I8+J8)","v":0},null,null,null,{"$f":"$C8*(L8+M8+N8)","v":0}]
["Pokaz dowolny",null,7,null,null,null,0,null,null,null,0,null,null,null,0]
["Pokaz dowolny",null,7,null,null,null,0,null,null,null,0,null,null,null,0]
["Pokaz dowolny",null,7,null,null,null,0,null,null,null,0,null,null,null,0]
["Pokaz dowolny",null,7,null,null,null,0,null,null,null,0,null,null,null,0]
["Pokaz dowolny",null,7,null,null,null,0,null,null,null,0,null,null,null,0]
["Pokaz dowolny",null,7,null,null,null,0,null,null,null,0,null,null,null,0]
["Pokaz dowolny",null,7,null,null,null,0,null,null,null,0,null,null,null,0]
["Pokaz dowolny",null,7,null,null,null,0,null,null,null,0,null,null,null,0]
["Podejście do lądowania i lądowanie",null,11,null,null,null,0,null,null,null,0,null,null,null,0]
["Realizm lotu\na) Prezentacja lotu",null,4,null,null,null,{"$f":"$C18*(D18+E18+F18)","v":0},null,null,null,{"$f":"$C18*(H18+I18+J18)","v":0},null,null,null,{"$f":"$C18*(L18+M18+N18)","v":0}]
["b) Prędkość modelu",null,9,null,null,null,{"$f":"$C19*(D19+E19+F19)","v":0},null,null,null,{"$f":"$C19*(H19+I19+J19)","v":0},null,null,null,{"$f":"$C19*(L19+M19+N19)","v":0}]
["c) Płynność lotu",null,9,null,null,null,{"$f":"$C20*(D20+E20+F20)","v":0},null,null,null,{"$f":"$C20*(H20+I20+J20)","v":0},null,null,null,{"$f":"$C20*(L20+M20+N20)","v":0}]
[null,null,null,null,null,null,{"$f":"SUM(G8:G20)","v":0},null,null,null,{"$f":"SUM(K8:K20)","v":0},null,null,null,{"$f":"SUM(O8:O20)","v":0}]
["Wynik lotów:",{"$f":"IF('Lista startowa F4H-P'!H1>1,ROUND(((G21+K21+O21)-MIN(G21,K21,O21))/2,0),G21)","v":0}]
[]
[]
["Ocena statyczna (F4H-P)",null,"K","Ocena statyczna",null,null,null,null,"Bonus:"]
["1. Dokładność odwzorowania w skali",null,null,"Sędzia I","Sędzia II","Sędzia III","Wynik",null,"Model wykonany od podstaw",null,null,0.2]
["Widok z boku ",null,4,null,null,null,{"$f":"$C27*(D27+E27+F27)","v":0}]
["Widok z góry",null,4,null,null,null,0]
["Widok z przodu/tyłu",null,4,null,null,null,0]
["2. Kolorystyka",null,7,null,null,null,0]
["3. Oznakowanie",null,4,null,null,null,0]
["4. Szczegóły",null,2,null,null,null,0]
[null,null,null,null,null,null,{"$f":"ROUND(SUM(G27:G32)*(J25+1),0)","v":0}]

{"sheet":"11","index":11,"n_rows":33,"n_cols":15,"rows_kept":33,"cut":false,"hidden":false,"merged":[[0,1,0,3],[1,1,1,3],[2,1,2,3],[31,0,31,1],[5,7,5,10],[5,11,5,14],[24,0,24,1],[24,3,24,6],[5,3,5,6],[29,0,29,1],[30,0,30,1],[28,0,28,1],[25,0,25,1],[27,0,27,1],[6,0,6,1],[7,0,7,1],[8,0,8,1],[9,0,9,1],[10,0,10,1],[17,0,17,1],[26,0,26,1],[25,8,25,10],[11,0,11,1],[12,0,12,1],[13,0,13,1],[14,0,14,1],[15,0,15,1],[18,0,18,1],[19,0,19,1]]}
["Nazwisko:",{"$f":"VLOOKUP(11,'Lista startowa F4H-P'!$A$5:$C$29,3,FALSE)","v":"Pilot 11"}]
["Model:",{"$f":"VLOOKUP(11,'Lista startowa F4H-P'!$A$5:$D$29,4,FALSE)","v":"Model 11"}]
["Nr Startowy:",{"$f":"VLOOKUP(11,'Lista startowa F4H-P'!$A$5:$C$29,2,FALSE)","v":11}]
[null,null,null,"S:",{"$f":"G33","v":0},"L1:",{"$f":"G21","v":0},"L2:",{"$f":"K21","v":0},"L3:",{"$f":"O21","v":0},"WL:",{"$f":"B22","v":0},"W:",{"$f":"B22+G33","v":0}]
[]
[null,null,null,"I Kolejka",null,null,null,"II Kolejka",null,null,null,"III Kolejka"]
["Program lotu",null,"K","Sędzia I","Sędzia II","Sędzia III","Wynik","Sędzia I","Sędzia II","Sędzia III","Wynik","Sędzia I","Sędzia II","Sędzia III","Wynik"]
["Start",null,11,null,null,null,{"$f":"$C8*(D8+E8+F8)","v":0},null,null,null,{"$f":"$C8*(H8+I8+J8)","v":0},null,null,null,{"$f":"$C8*(L8+M8+N8)","v":0}]
["Pokaz dowolny",null,7,null,null,null,0,null,null,null,0,null,null,null,0]
["Pokaz dowolny",null,7,null,null,null,0,null,null,null,0,null,null,null,0]
["Pokaz dowolny",null,7,null,null,null,0,null,null,null,0,null,null,null,0]
["Pokaz dowolny",null,7,null,null,null,0,null,null,null,0,null,null,null,0]
["Pokaz dowolny",null,7,null,null,null,0,null,null,null,0,null,null,null,0]
["Pokaz dowolny",null,7,null,null,null,0,null,null,null,0,null,null,null,0]
["Pokaz dowolny",null,7,null,null,null,0,null,null,null,0,null,null,null,0]
["Pokaz dowolny",null,7,null,null,null,0,null,null,null,0,null,null,null,0]
["Podejście do lądowania i lądowanie",null,11,null,null,null,0,null,null,null,0,null,null,null,0]
["Realizm lotu\na) Prezentacja lotu",null,4,null,null,null,{"$f":"$C18*(D18+E18+F18)","v":0},null,null,null,{"$f":"$C18*(H18+I18+J18)","v":0},null,null,null,{"$f":"$C18*(L18+M18+N18)","v":0}]
["b) Prędkość modelu",null,9,null,null,null,{"$f":"$C19*(D19+E19+F19)","v":0},null,null,null,{"$f":"$C19*(H19+I19+J19)","v":0},null,null,null,{"$f":"$C19*(L19+M19+N19)","v":0}]
["c) Płynność lotu",null,9,null,null,null,{"$f":"$C20*(D20+E20+F20)","v":0},null,null,null,{"$f":"$C20*(H20+I20+J20)","v":0},null,null,null,{"$f":"$C20*(L20+M20+N20)","v":0}]
[null,null,null,null,null,null,{"$f":"SUM(G8:G20)","v":0},null,null,null,{"$f":"SUM(K8:K20)","v":0},null,null,null,{"$f":"SUM(O8:O20)","v":0}]
["Wynik lotów:",{"$f":"IF('Lista startowa F4H-P'!H1>1,ROUND(((G21+K21+O21)-MIN(G21,K21,O21))/2,0),G21)","v":0}]
[]
[]
["Ocena statyczna (F4H-P)",null,"K","Ocena statyczna",null,null,null,null,"Bonus:"]
["1. Dokładność odwzorowania w skali",null,null,"Sędzia I","Sędzia II","Sędzia III","Wynik",null,"Model wykonany od podstaw",null,null,0.2]
["Widok z boku ",null,4,null,null,null,{"$f":"$C27*(D27+E27+F27)","v":0}]
["Widok z góry",null,4,null,null,null,0]
["Widok z przodu/tyłu",null,4,null,null,null,0]
["2. Kolorystyka",null,7,null,null,null,0]
["3. Oznakowanie",null,4,null,null,null,0]
["4. Szczegóły",null,2,null,null,null,0]
[null,null,null,null,null,null,{"$f":"ROUND(SUM(G27:G32)*(J25+1),0)","v":0}]

{"sheet":"12","index":12,"n_rows":33,"n_cols":15,"rows_kept":33,"cut":false,"hidden":false,"merged":[[18,0,18,1],[19,0,19,1],[0,1,0,3],[1,1,1,3],[2,1,2,3],[11,0,11,1],[12,0,12,1],[13,0,13,1],[14,0,14,1],[15,0,15,1],[31,0,31,1],[29,0,29,1],[30,0,30,1],[25,0,25,1],[28,0,28,1],[26,0,26,1],[27,0,27,1],[17,0,17,1],[25,8,25,10],[5,7,5,10],[5,11,5,14],[24,0,24,1],[24,3,24,6],[5,3,5,6],[6,0,6,1],[7,0,7,1],[8,0,8,1],[9,0,9,1],[10,0,10,1]]}
["Nazwisko:",{"$f":"VLOOKUP(12,'Lista startowa F4H-P'!$A$5:$C$29,3,FALSE)","v":"Pilot 12"}]
["Model:",{"$f":"VLOOKUP(12,'Lista startowa F4H-P'!$A$5:$D$29,4,FALSE)","v":"Model 12"}]
["Nr Startowy:",{"$f":"VLOOKUP(12,'Lista startowa F4H-P'!$A$5:$C$29,2,FALSE)","v":12}]
[null,null,null,"S:",{"$f":"G33","v":0},"L1:",{"$f":"G21","v":0},"L2:",{"$f":"K21","v":0},"L3:",{"$f":"O21","v":0},"WL:",{"$f":"B22","v":0},"W:",{"$f":"B22+G33","v":0}]
[]
[null,null,null,"I Kolejka",null,null,null,"II Kolejka",null,null,null,"III Kolejka"]
["Program lotu",null,"K","Sędzia I","Sędzia II","Sędzia III","Wynik","Sędzia I","Sędzia II","Sędzia III","Wynik","Sędzia I","Sędzia II","Sędzia III","Wynik"]
["Start",null,11,null,null,null,{"$f":"$C8*(D8+E8+F8)","v":0},null,null,null,{"$f":"$C8*(H8+I8+J8)","v":0},null,null,null,{"$f":"$C8*(L8+M8+N8)","v":0}]
["Pokaz dowolny",null,7,null,null,null,0,null,null,null,0,null,null,null,0]
["Pokaz dowolny",null,7,null,null,null,0,null,null,null,0,null,null,null,0]
["Pokaz dowolny",null,7,null,null,null,0,null,null,null,0,null,null,null,0]
["Pokaz dowolny",null,7,null,null,null,0,null,null,null,0,null,null,null,0]
["Pokaz dowolny",null,7,null,null,null,0,null,null,null,0,null,null,null,0]
["Pokaz dowolny",null,7,null,null,null,0,null,null,null,0,null,null,null,0]
["Pokaz dowolny",null,7,null,null,null,0,null,null,null,0,null,null,null,0]
["Pokaz dowolny",null,7,null,null,null,0,null,null,null,0,null,null,null,0]
["Podejście do lądowania i lądowanie",null,11,null,null,null,0,null,null,null,0,null,null,null,0]
["Realizm lotu\na) Prezentacja lotu",null,4,null,null,null,{"$f":"$C18*(D18+E18+F18)","v":0},null,null,null,{"$f":"$C18*(H18+I18+J18)","v":0},null,null,null,{"$f":"$C18*(L18+M18+N18)","v":0}]
["b) Prędkość modelu",null,9,null,null,null,{"$f":"$C19*(D19+E19+F19)","v":0},null,null,null,{"$f":"$C19*(H19+I19+J19)","v":0},null,null,null,{"$f":"$C19*(L19+M19+N19)","v":0}]
["c) Płynność lotu",null,9,null,null,null,{"$f":"$C20*(D20+E20+F20)","v":0},null,null,null,{"$f":"$C20*(H20+I20+J20)","v":0},null,null,null,{"$f":"$C20*(L20+M20+N20)","v":0}]
[null,null,null,null,null,null,{"$f":"SUM(G8:G20)","v":0},null,null,null,{"$f":"SUM(K8:K20)","v":0},null,null,null,{"$f":"SUM(O8:O20)","v":0}]
["Wynik lotów:",{"$f":"IF('Lista startowa F4H-P'!H1>1,ROUND(((G21+K21+O21)-MIN(G21,K21,O21))/2,0),G21)","v":0}]
[]
[]
["Ocena statyczna (F4H-P)",null,"K","Ocena statyczna",null,null,null,null,"Bonus:"]
["1. Dokładność odwzorowania w skali",null,null,"Sędzia I","Sędzia II","Sędzia III","Wynik",null,"Model wykonany od podstaw",null,null,0.2]
["Widok z boku ",null,4,null,null,null,{"$f":"$C27*(D27+E27+F27)","v":0}]
["Widok z góry",null,4,null,null,null,0]
["Widok z przodu/tyłu",null,4,null,null,null,0]
["2. Kolorystyka",null,7,null,null,null,0]
["3. Oznakowanie",null,4,null,null,null,0]
["4. Szczegóły",null,2,null,null,null,0]
[null,null,null,null,null,null,{"$f":"ROUND(SUM(G27:G32)*(J25+1),0)","v":0}]

{"sheet":"13","index":13,"n_rows":33,"n_cols":15,"rows_kept":33,"cut":false,"hidden":false,"merged":[[0,1,0,3],[1,1,1,3],[2,1,2,3],[31,0,31,1],[5,7,5,10],[5,11,5,14],[24,0,24,1],[24,3,24,6],[5,3,5,6],[29,0,29,1],[30,0,30,1],[28,0,28,1],[25,0,25,1],[27,0,27,1],[6,0,6,1],[7,0,7,1],[8,0,8,1],[9,0,9,1],[10,0,10,1],[17,0,17,1],[26,0,26,1],[25,8,25,10],[11,0,11,1],[12,0,12,1],[13,0,13,1],[14,0,14,1],[15,0,15,1],[18,0,18,1],[19,0,19,1]]}
["Nazwisko:",{"$f":"VLOOKUP(13,'Lista startowa F4H-P'!$A$5:$C$29,3,FALSE)","v":"Pilot 13"}]
["Model:",{"$f":"VLOOKUP(13,'Lista startowa F4H-P'!$A$5:$D$29,4,FALSE)","v":"Model 13"}]
["Nr Startowy:",{"$f":"VLOOKUP(13,'Lista startowa F4H-P'!$A$5:$C$29,2,FALSE)","v":13}]
[null,null,null,"S:",{"$f":"G33","v":0},"L1:",{"$f":"G21","v":0},"L2:",{"$f":"K21","v":0},"L3:",{"$f":"O21","v":0},"WL:",{"$f":"B22","v":0},"W:",{"$f":"B22+G33","v":0}]
[]
[null,null,null,"I Kolejka",null,null,null,"II Kolejka",null,null,null,"III Kolejka"]
["Program lotu",null,"K","Sędzia I","Sędzia II","Sędzia III","Wynik","Sędzia I","Sędzia II","Sędzia III","Wynik","Sędzia I","Sędzia II","Sędzia III","Wynik"]
["Start",null,11,null,null,null,{"$f":"$C8*(D8+E8+F8)","v":0},null,null,null,{"$f":"$C8*(H8+I8+J8)","v":0},null,null,null,{"$f":"$C8*(L8+M8+N8)","v":0}]
["Pokaz dowolny",null,7,null,null,null,0,null,null,null,0,null,null,null,0]
["Pokaz dowolny",null,7,null,null,null,0,null,null,null,0,null,null,null,0]
["Pokaz dowolny",null,7,null,null,null,0,null,null,null,0,null,null,null,0]
["Pokaz dowolny",null,7,null,null,null,0,null,null,null,0,null,null,null,0]
["Pokaz dowolny",null,7,null,null,null,0,null,null,null,0,null,null,null,0]
["Pokaz dowolny",null,7,null,null,null,0,null,null,null,0,null,null,null,0]
["Pokaz dowolny",null,7,null,null,null,0,null,null,null,0,null,null,null,0]
["Pokaz dowolny",null,7,null,null,null,0,null,null,null,0,null,null,null,0]
["Podejście do lądowania i lądowanie",null,11,null,null,null,0,null,null,null,0,null,null,null,0]
["Realizm lotu\na) Prezentacja lotu",null,4,null,null,null,{"$f":"$C18*(D18+E18+F18)","v":0},null,null,null,{"$f":"$C18*(H18+I18+J18)","v":0},null,null,null,{"$f":"$C18*(L18+M18+N18)","v":0}]
["b) Prędkość modelu",null,9,null,null,null,{"$f":"$C19*(D19+E19+F19)","v":0},null,null,null,{"$f":"$C19*(H19+I19+J19)","v":0},null,null,null,{"$f":"$C19*(L19+M19+N19)","v":0}]
["c) Płynność lotu",null,9,null,null,null,{"$f":"$C20*(D20+E20+F20)","v":0},null,null,null,{"$f":"$C20*(H20+I20+J20)","v":0},null,null,null,{"$f":"$C20*(L20+M20+N20)","v":0}]
[null,null,null,null,null,null,{"$f":"SUM(G8:G20)","v":0},null,null,null,{"$f":"SUM(K8:K20)","v":0},null,null,null,{"$f":"SUM(O8:O20)","v":0}]
["Wynik lotów:",{"$f":"IF('Lista startowa F4H-P'!H1>1,ROUND(((G21+K21+O21)-MIN(G21,K21,O21))/2,0),G21)","v":0}]
[]
[]
["Ocena statyczna (F4H-P)",null,"K","Ocena statyczna",null,null,null,null,"Bonus:"]
["1. Dokładność odwzorowania w skali",null,null,"Sędzia I","Sędzia II","Sędzia III","Wynik",null,"Model wykonany od podstaw",null,null,0.2]
["Widok z boku ",null,4,null,null,null,{"$f":"$C27*(D27+E27+F27)","v":0}]
["Widok z góry",null,4,null,null,null,0]
["Widok z przodu/tyłu",null,4,null,null,null,0]
["2. Kolorystyka",null,7,null,null,null,0]
["3. Oznakowanie",null,4,null,null,null,0]
["4. Szczegóły",null,2,null,null,null,0]
[null,null,null,null,null,null,{"$f":"ROUND(SUM(G27:G32)*(J25+1),0)","v":0}]

{"sheet":"14","index":14,"n_rows":33,"n_cols":15,"rows_kept":33,"cut":false,"hidden":false,"merged":[[18,0,18,1],[19,0,19,1],[0,1,0,3],[1,1,1,3],[2,1,2,3],[11,0,11,1],[12,0,12,1],[13,0,13,1],[14,0,14,1],[15,0,15,1],[31,0,31,1],[29,0,29,1],[30,0,30,1],[25,0,25,1],[28,0,28,1],[26,0,26,1],[27,0,27,1],[17,0,17,1],[25,8,25,10],[5,7,5,10],[5,11,5,14],[24,0,24,1],[24,3,24,6],[5,3,5,6],[6,0,6,1],[7,0,7,1],[8,0,8,1],[9,0,9,1],[10,0,10,1]]}
["Nazwisko:",{"$f":"VLOOKUP(14,'Lista startowa F4H-P'!$A$5:$C$29,3,FALSE)","v":"Pilot 14"}]
["Model:",{"$f":"VLOOKUP(14,'Lista startowa F4H-P'!$A$5:$D$29,4,FALSE)","v":"Model 14"}]
["Nr Startowy:",{"$f":"VLOOKUP(14,'Lista startowa F4H-P'!$A$5:$C$29,2,FALSE)","v":14}]
[null,null,null,"S:",{"$f":"G33","v":0},"L1:",{"$f":"G21","v":0},"L2:",{"$f":"K21","v":0},"L3:",{"$f":"O21","v":0},"WL:",{"$f":"B22","v":0},"W:",{"$f":"B22+G33","v":0}]
[]
[null,null,null,"I Kolejka",null,null,null,"II Kolejka",null,null,null,"III Kolejka"]
["Program lotu",null,"K","Sędzia I","Sędzia II","Sędzia III","Wynik","Sędzia I","Sędzia II","Sędzia III","Wynik","Sędzia I","Sędzia II","Sędzia III","Wynik"]
["Start",null,11,null,null,null,{"$f":"$C8*(D8+E8+F8)","v":0},null,null,null,{"$f":"$C8*(H8+I8+J8)","v":0},null,null,null,{"$f":"$C8*(L8+M8+N8)","v":0}]
["Pokaz dowolny",null,7,null,null,null,0,null,null,null,0,null,null,null,0]
["Pokaz dowolny",null,7,null,null,null,0,null,null,null,0,null,null,null,0]
["Pokaz dowolny",null,7,null,null,null,0,null,null,null,0,null,null,null,0]
["Pokaz dowolny",null,7,null,null,null,0,null,null,null,0,null,null,null,0]
["Pokaz dowolny",null,7,null,null,null,0,null,null,null,0,null,null,null,0]
["Pokaz dowolny",null,7,null,null,null,0,null,null,null,0,null,null,null,0]
["Pokaz dowolny",null,7,null,null,null,0,null,null,null,0,null,null,null,0]
["Pokaz dowolny",null,7,null,null,null,0,null,null,null,0,null,null,null,0]
["Podejście do lądowania i lądowanie",null,11,null,null,null,0,null,null,null,0,null,null,null,0]
["Realizm lotu\na) Prezentacja lotu",null,4,null,null,null,{"$f":"$C18*(D18+E18+F18)","v":0},null,null,null,{"$f":"$C18*(H18+I18+J18)","v":0},null,null,null,{"$f":"$C18*(L18+M18+N18)","v":0}]
["b) Prędkość modelu",null,9,null,null,null,{"$f":"$C19*(D19+E19+F19)","v":0},null,null,null,{"$f":"$C19*(H19+I19+J19)","v":0},null,null,null,{"$f":"$C19*(L19+M19+N19)","v":0}]
["c) Płynność lotu",null,9,null,null,null,{"$f":"$C20*(D20+E20+F20)","v":0},null,null,null,{"$f":"$C20*(H20+I20+J20)","v":0},null,null,null,{"$f":"$C20*(L20+M20+N20)","v":0}]
[null,null,null,null,null,null,{"$f":"SUM(G8:G20)","v":0},null,null,null,{"$f":"SUM(K8:K20)","v":0},null,null,null,{"$f":"SUM(O8:O20)","v":0}]
["Wynik lotów:",{"$f":"IF('Lista startowa F4H-P'!H1>1,ROUND(((G21+K21+O21)-MIN(G21,K21,O21))/2,0),G21)","v":0}]
[]
[]
["Ocena statyczna (F4H-P)",null,"K","Ocena statyczna",null,null,null,null,"Bonus:"]
["1. Dokładność odwzorowania w skali",null,null,"Sędzia I","Sędzia II","Sędzia III","Wynik",null,"Model wykonany od podstaw",null,null,0.2]
["Widok z boku ",null,4,null,null,null,{"$f":"$C27*(D27+E27+F27)","v":0}]
["Widok z góry",null,4,null,null,null,0]
["Widok z przodu/tyłu",null,4,null,null,null,0]
["2. Kolorystyka",null,7,null,null,null,0]
["3. Oznakowanie",null,4,null,null,null,0]
["4. Szczegóły",null,2,null,null,null,0]
[null,null,null,null,null,null,{"$f":"ROUND(SUM(G27:G32)*(J25+1),0)","v":0}]

{"sheet":"15","index":15,"n_rows":33,"n_cols":15,"rows_kept":33,"cut":false,"hidden":false,"merged":[[0,1,0,3],[1,1,1,3],[2,1,2,3],[31,0,31,1],[5,7,5,10],[5,11,5,14],[24,0,24,1],[24,3,24,6],[5,3,5,6],[29,0,29,1],[30,0,30,1],[28,0,28,1],[25,0,25,1],[27,0,27,1],[6,0,6,1],[7,0,7,1],[8,0,8,1],[9,0,9,1],[10,0,10,1],[17,0,17,1],[26,0,26,1],[25,8,25,10],[11,0,11,1],[12,0,12,1],[13,0,13,1],[14,0,14,1],[15,0,15,1],[18,0,18,1],[19,0,19,1]]}
["Nazwisko:",{"$f":"VLOOKUP(15,'Lista startowa F4H-P'!$A$5:$C$29,3,FALSE)","v":"Pilot 15"}]
["Model:",{"$f":"VLOOKUP(15,'Lista startowa F4H-P'!$A$5:$D$29,4,FALSE)","v":"Model 15"}]
["Nr Startowy:",{"$f":"VLOOKUP(15,'Lista startowa F4H-P'!$A$5:$C$29,2,FALSE)","v":15}]
[null,null,null,"S:",{"$f":"G33","v":0},"L1:",{"$f":"G21","v":0},"L2:",{"$f":"K21","v":0},"L3:",{"$f":"O21","v":0},"WL:",{"$f":"B22","v":0},"W:",{"$f":"B22+G33","v":0}]
[]
[null,null,null,"I Kolejka",null,null,null,"II Kolejka",null,null,null,"III Kolejka"]
["Program lotu",null,"K","Sędzia I","Sędzia II","Sędzia III","Wynik","Sędzia I","Sędzia II","Sędzia III","Wynik","Sędzia I","Sędzia II","Sędzia III","Wynik"]
["Start",null,11,null,null,null,{"$f":"$C8*(D8+E8+F8)","v":0},null,null,null,{"$f":"$C8*(H8+I8+J8)","v":0},null,null,null,{"$f":"$C8*(L8+M8+N8)","v":0}]
["Pokaz dowolny",null,7,null,null,null,0,null,null,null,0,null,null,null,0]
["Pokaz dowolny",null,7,null,null,null,0,null,null,null,0,null,null,null,0]
["Pokaz dowolny",null,7,null,null,null,0,null,null,null,0,null,null,null,0]
["Pokaz dowolny",null,7,null,null,null,0,null,null,null,0,null,null,null,0]
["Pokaz dowolny",null,7,null,null,null,0,null,null,null,0,null,null,null,0]
["Pokaz dowolny",null,7,null,null,null,0,null,null,null,0,null,null,null,0]
["Pokaz dowolny",null,7,null,null,null,0,null,null,null,0,null,null,null,0]
["Pokaz dowolny",null,7,null,null,null,0,null,null,null,0,null,null,null,0]
["Podejście do lądowania i lądowanie",null,11,null,null,null,0,null,null,null,0,null,null,null,0]
["Realizm lotu\na) Prezentacja lotu",null,4,null,null,null,{"$f":"$C18*(D18+E18+F18)","v":0},null,null,null,{"$f":"$C18*(H18+I18+J18)","v":0},null,null,null,{"$f":"$C18*(L18+M18+N18)","v":0}]
["b) Prędkość modelu",null,9,null,null,null,{"$f":"$C19*(D19+E19+F19)","v":0},null,null,null,{"$f":"$C19*(H19+I19+J19)","v":0},null,null,null,{"$f":"$C19*(L19+M19+N19)","v":0}]
["c) Płynność lotu",null,9,null,null,null,{"$f":"$C20*(D20+E20+F20)","v":0},null,null,null,{"$f":"$C20*(H20+I20+J20)","v":0},null,null,null,{"$f":"$C20*(L20+M20+N20)","v":0}]
[null,null,null,null,null,null,{"$f":"SUM(G8:G20)","v":0},null,null,null,{"$f":"SUM(K8:K20)","v":0},null,null,null,{"$f":"SUM(O8:O20)","v":0}]
["Wynik lotów:",{"$f":"IF('Lista startowa F4H-P'!H1>1,ROUND(((G21+K21+O21)-MIN(G21,K21,O21))/2,0),G21)","v":0}]
[]
[]
["Ocena statyczna (F4H-P)",null,"K","Ocena statyczna",null,null,null,null,"Bonus:"]
["1. Dokładność odwzorowania w skali",null,null,"Sędzia I","Sędzia II","Sędzia III","Wynik",null,"Model wykonany od podstaw",null,null,0.2]
["Widok z boku ",null,4,null,null,null,{"$f":"$C27*(D27+E27+F27)","v":0}]
["Widok z góry",null,4,null,null,null,0]
["Widok z przodu/tyłu",null,4,null,null,null,0]
["2. Kolorystyka",null,7,null,null,null,0]
["3. Oznakowanie",null,4,null,null,null,0]
["4. Szczegóły",null,2,null,null,null,0]
[null,null,null,null,null,null,{"$f":"ROUND(SUM(G27:G32)*(J25+1),0)","v":0}]

{"sheet":"16","index":16,"n_rows":33,"n_cols":15,"rows_kept":33,"cut":false,"hidden":false,"merged":[[18,0,18,1],[19,0,19,1],[0,1,0,3],[1,1,1,3],[2,1,2,3],[11,0,11,1],[12,0,12,1],[13,0,13,1],[14,0,14,1],[15,0,15,1],[31,0,31,1],[29,0,29,1],[30,0,30,1],[25,0,25,1],[28,0,28,1],[26,0,26,1],[27,0,27,1],[17,0,17,1],[25,8,25,10],[5,7,5,10],[5,11,5,14],[24,0,24,1],[24,3,24,6],[5,3,5,6],[6,0,6,1],[7,0,7,1],[8,0,8,1],[9,0,9,1],[10,0,10,1]]}
["Nazwisko:",{"$f":"VLOOKUP(16,'Lista startowa F4H-P'!$A$5:$C$29,3,FALSE)","v":"Pilot 16"}]
["Model:",{"$f":"VLOOKUP(16,'Lista startowa F4H-P'!$A$5:$D$29,4,FALSE)","v":"Model 16"}]
["Nr Startowy:",{"$f":"VLOOKUP(16,'Lista startowa F4H-P'!$A$5:$C$29,2,FALSE)","v":16}]
[null,null,null,"S:",{"$f":"G33","v":0},"L1:",{"$f":"G21","v":0},"L2:",{"$f":"K21","v":0},"L3:",{"$f":"O21","v":0},"WL:",{"$f":"B22","v":0},"W:",{"$f":"B22+G33","v":0}]
[]
[null,null,null,"I Kolejka",null,null,null,"II Kolejka",null,null,null,"III Kolejka"]
["Program lotu",null,"K","Sędzia I","Sędzia II","Sędzia III","Wynik","Sędzia I","Sędzia II","Sędzia III","Wynik","Sędzia I","Sędzia II","Sędzia III","Wynik"]
["Start",null,11,null,null,null,{"$f":"$C8*(D8+E8+F8)","v":0},null,null,null,{"$f":"$C8*(H8+I8+J8)","v":0},null,null,null,{"$f":"$C8*(L8+M8+N8)","v":0}]
["Pokaz dowolny",null,7,null,null,null,0,null,null,null,0,null,null,null,0]
["Pokaz dowolny",null,7,null,null,null,0,null,null,null,0,null,null,null,0]
["Pokaz dowolny",null,7,null,null,null,0,null,null,null,0,null,null,null,0]
["Pokaz dowolny",null,7,null,null,null,0,null,null,null,0,null,null,null,0]
["Pokaz dowolny",null,7,null,null,null,0,null,null,null,0,null,null,null,0]
["Pokaz dowolny",null,7,null,null,null,0,null,null,null,0,null,null,null,0]
["Pokaz dowolny",null,7,null,null,null,0,null,null,null,0,null,null,null,0]
["Pokaz dowolny",null,7,null,null,null,0,null,null,null,0,null,null,null,0]
["Podejście do lądowania i lądowanie",null,11,null,null,null,0,null,null,null,0,null,null,null,0]
["Realizm lotu\na) Prezentacja lotu",null,4,null,null,null,{"$f":"$C18*(D18+E18+F18)","v":0},null,null,null,{"$f":"$C18*(H18+I18+J18)","v":0},null,null,null,{"$f":"$C18*(L18+M18+N18)","v":0}]
["b) Prędkość modelu",null,9,null,null,null,{"$f":"$C19*(D19+E19+F19)","v":0},null,null,null,{"$f":"$C19*(H19+I19+J19)","v":0},null,null,null,{"$f":"$C19*(L19+M19+N19)","v":0}]
["c) Płynność lotu",null,9,null,null,null,{"$f":"$C20*(D20+E20+F20)","v":0},null,null,null,{"$f":"$C20*(H20+I20+J20)","v":0},null,null,null,{"$f":"$C20*(L20+M20+N20)","v":0}]
[null,null,null,null,null,null,{"$f":"SUM(G8:G20)","v":0},null,null,null,{"$f":"SUM(K8:K20)","v":0},null,null,null,{"$f":"SUM(O8:O20)","v":0}]
["Wynik lotów:",{"$f":"IF('Lista startowa F4H-P'!H1>1,ROUND(((G21+K21+O21)-MIN(G21,K21,O21))/2,0),G21)","v":0}]
[]
[]
["Ocena statyczna (F4H-P)",null,"K","Ocena statyczna",null,null,null,null,"Bonus:"]
["1. Dokładność odwzorowania w skali",null,null,"Sędzia I","Sędzia II","Sędzia III","Wynik",null,"Model wykonany od podstaw",null,null,0.2]
["Widok z boku ",null,4,null,null,null,{"$f":"$C27*(D27+E27+F27)","v":0}]
["Widok z góry",null,4,null,null,null,0]
["Widok z przodu/tyłu",null,4,null,null,null,0]
["2. Kolorystyka",null,7,null,null,null,0]
["3. Oznakowanie",null,4,null,null,null,0]
["4. Szczegóły",null,2,null,null,null,0]
[null,null,null,null,null,null,{"$f":"ROUND(SUM(G27:G32)*(J25+1),0)","v":0}]

{"sheet":"17","index":17,"n_rows":33,"n_cols":15,"rows_kept":33,"cut":false,"hidden":false,"merged":[[0,1,0,3],[1,1,1,3],[2,1,2,3],[31,0,31,1],[5,7,5,10],[5,11,5,14],[24,0,24,1],[24,3,24,6],[5,3,5,6],[29,0,29,1],[30,0,30,1],[28,0,28,1],[25,0,25,1],[27,0,27,1],[6,0,6,1],[7,0,7,1],[8,0,8,1],[9,0,9,1],[10,0,10,1],[17,0,17,1],[26,0,26,1],[25,8,25,10],[11,0,11,1],[12,0,12,1],[13,0,13,1],[14,0,14,1],[15,0,15,1],[18,0,18,1],[19,0,19,1]]}
["Nazwisko:",{"$f":"VLOOKUP(17,'Lista startowa F4H-P'!$A$5:$C$29,3,FALSE)","v":"Pilot 17"}]
["Model:",{"$f":"VLOOKUP(17,'Lista startowa F4H-P'!$A$5:$D$29,4,FALSE)","v":"Model 17"}]
["Nr Startowy:",{"$f":"VLOOKUP(17,'Lista startowa F4H-P'!$A$5:$C$29,2,FALSE)","v":17}]
[null,null,null,"S:",{"$f":"G33","v":0},"L1:",{"$f":"G21","v":0},"L2:",{"$f":"K21","v":0},"L3:",{"$f":"O21","v":0},"WL:",{"$f":"B22","v":0},"W:",{"$f":"B22+G33","v":0}]
[]
[null,null,null,"I Kolejka",null,null,null,"II Kolejka",null,null,null,"III Kolejka"]
["Program lotu",null,"K","Sędzia I","Sędzia II","Sędzia III","Wynik","Sędzia I","Sędzia II","Sędzia III","Wynik","Sędzia I","Sędzia II","Sędzia III","Wynik"]
["Start",null,11,null,null,null,{"$f":"$C8*(D8+E8+F8)","v":0},null,null,null,{"$f":"$C8*(H8+I8+J8)","v":0},null,null,null,{"$f":"$C8*(L8+M8+N8)","v":0}]
["Pokaz dowolny",null,7,null,null,null,0,null,null,null,0,null,null,null,0]
["Pokaz dowolny",null,7,null,null,null,0,null,null,null,0,null,null,null,0]
["Pokaz dowolny",null,7,null,null,null,0,null,null,null,0,null,null,null,0]
["Pokaz dowolny",null,7,null,null,null,0,null,null,null,0,null,null,null,0]
["Pokaz dowolny",null,7,null,null,null,0,null,null,null,0,null,null,null,0]
["Pokaz dowolny",null,7,null,null,null,0,null,null,null,0,null,null,null,0]
["Pokaz dowolny",null,7,null,null,null,0,null,null,null,0,null,null,null,0]
["Pokaz dowolny",null,7,null,null,null,0,null,null,null,0,null,null,null,0]
["Podejście do lądowania i lądowanie",null,11,null,null,null,0,null,null,null,0,null,null,null,0]
["Realizm lotu\na) Prezentacja lotu",null,4,null,null,null,{"$f":"$C18*(D18+E18+F18)","v":0},null,null,null,{"$f":"$C18*(H18+I18+J18)","v":0},null,null,null,{"$f":"$C18*(L18+M18+N18)","v":0}]
["b) Prędkość modelu",null,9,null,null,null,{"$f":"$C19*(D19+E19+F19)","v":0},null,null,null,{"$f":"$C19*(H19+I19+J19)","v":0},null,null,null,{"$f":"$C19*(L19+M19+N19)","v":0}]
["c) Płynność lotu",null,9,null,null,null,{"$f":"$C20*(D20+E20+F20)","v":0},null,null,null,{"$f":"$C20*(H20+I20+J20)","v":0},null,null,null,{"$f":"$C20*(L20+M20+N20)","v":0}]
[null,null,null,null,null,null,{"$f":"SUM(G8:G20)","v":0},null,null,null,{"$f":"SUM(K8:K20)","v":0},null,null,null,{"$f":"SUM(O8:O20)","v":0}]
["Wynik lotów:",{"$f":"IF('Lista startowa F4H-P'!H1>1,ROUND(((G21+K21+O21)-MIN(G21,K21,O21))/2,0),G21)","v":0}]
[]
[]
["Ocena statyczna (F4H-P)",null,"K","Ocena statyczna",null,null,null,null,"Bonus:"]
["1. Dokładność odwzorowania w skali",null,null,"Sędzia I","Sędzia II","Sędzia III","Wynik",null,"Model wykonany od podstaw",null,null,0.2]
["Widok z boku ",null,4,null,null,null,{"$f":"$C27*(D27+E27+F27)","v":0}]
["Widok z góry",null,4,null,null,null,0]
["Widok z przodu/tyłu",null,4,null,null,null,0]
["2. Kolorystyka",null,7,null,null,null,0]
["3. Oznakowanie",null,4,null,null,null,0]
["4. Szczegóły",null,2,null,null,null,0]
[null,null,null,null,null,null,{"$f":"ROUND(SUM(G27:G32)*(J25+1),0)","v":0}]

{"sheet":"18","index":18,"n_rows":33,"n_cols":15,"rows_kept":33,"cut":false,"hidden":false,"merged":[[18,0,18,1],[19,0,19,1],[0,1,0,3],[1,1,1,3],[2,1,2,3],[11,0,11,1],[12,0,12,1],[13,0,13,1],[14,0,14,1],[15,0,15,1],[31,0,31,1],[29,0,29,1],[30,0,30,1],[25,0,25,1],[28,0,28,1],[26,0,26,1],[27,0,27,1],[17,0,17,1],[25,8,25,10],[5,7,5,10],[5,11,5,14],[24,0,24,1],[24,3,24,6],[5,3,5,6],[6,0,6,1],[7,0,7,1],[8,0,8,1],[9,0,9,1],[10,0,10,1]]}
["Nazwisko:",{"$f":"VLOOKUP(18,'Lista startowa F4H-P'!$A$5:$C$29,3,FALSE)","v":"Pilot 18"}]
["Model:",{"$f":"VLOOKUP(18,'Lista startowa F4H-P'!$A$5:$D$29,4,FALSE)","v":"Model 18"}]
["Nr Startowy:",{"$f":"VLOOKUP(18,'Lista startowa F4H-P'!$A$5:$C$29,2,FALSE)","v":18}]
[null,null,null,"S:",{"$f":"G33","v":0},"L1:",{"$f":"G21","v":0},"L2:",{"$f":"K21","v":0},"L3:",{"$f":"O21","v":0},"WL:",{"$f":"B22","v":0},"W:",{"$f":"B22+G33","v":0}]
[]
[null,null,null,"I Kolejka",null,null,null,"II Kolejka",null,null,null,"III Kolejka"]
["Program lotu",null,"K","Sędzia I","Sędzia II","Sędzia III","Wynik","Sędzia I","Sędzia II","Sędzia III","Wynik","Sędzia I","Sędzia II","Sędzia III","Wynik"]
["Start",null,11,null,null,null,{"$f":"$C8*(D8+E8+F8)","v":0},null,null,null,{"$f":"$C8*(H8+I8+J8)","v":0},null,null,null,{"$f":"$C8*(L8+M8+N8)","v":0}]
["Pokaz dowolny",null,7,null,null,null,0,null,null,null,0,null,null,null,0]
["Pokaz dowolny",null,7,null,null,null,0,null,null,null,0,null,null,null,0]
["Pokaz dowolny",null,7,null,null,null,0,null,null,null,0,null,null,null,0]
["Pokaz dowolny",null,7,null,null,null,0,null,null,null,0,null,null,null,0]
["Pokaz dowolny",null,7,null,null,null,0,null,null,null,0,null,null,null,0]
["Pokaz dowolny",null,7,null,null,null,0,null,null,null,0,null,null,null,0]
["Pokaz dowolny",null,7,null,null,null,0,null,null,null,0,null,null,null,0]
["Pokaz dowolny",null,7,null,null,null,0,null,null,null,0,null,null,null,0]
["Podejście do lądowania i lądowanie",null,11,null,null,null,0,null,null,null,0,null,null,null,0]
["Realizm lotu\na) Prezentacja lotu",null,4,null,null,null,{"$f":"$C18*(D18+E18+F18)","v":0},null,null,null,{"$f":"$C18*(H18+I18+J18)","v":0},null,null,null,{"$f":"$C18*(L18+M18+N18)","v":0}]
["b) Prędkość modelu",null,9,null,null,null,{"$f":"$C19*(D19+E19+F19)","v":0},null,null,null,{"$f":"$C19*(H19+I19+J19)","v":0},null,null,null,{"$f":"$C19*(L19+M19+N19)","v":0}]
["c) Płynność lotu",null,9,null,null,null,{"$f":"$C20*(D20+E20+F20)","v":0},null,null,null,{"$f":"$C20*(H20+I20+J20)","v":0},null,null,null,{"$f":"$C20*(L20+M20+N20)","v":0}]
[null,null,null,null,null,null,{"$f":"SUM(G8:G20)","v":0},null,null,null,{"$f":"SUM(K8:K20)","v":0},null,null,null,{"$f":"SUM(O8:O20)","v":0}]
["Wynik lotów:",{"$f":"IF('Lista startowa F4H-P'!H1>1,ROUND(((G21+K21+O21)-MIN(G21,K21,O21))/2,0),G21)","v":0}]
[]
[]
["Ocena statyczna (F4H-P)",null,"K","Ocena statyczna",null,null,null,null,"Bonus:"]
["1. Dokładność odwzorowania w skali",null,null,"Sędzia I","Sędzia II","Sędzia III","Wynik",null,"Model wykonany od podstaw",null,null,0.2]
["Widok z boku ",null,4,null,null,null,{"$f":"$C27*(D27+E27+F27)","v":0}]
["Widok z góry",null,4,null,null,null,0]
["Widok z przodu/tyłu",null,4,null,null,null,0]
["2. Kolorystyka",null,7,null,null,null,0]
["3. Oznakowanie",null,4,null,null,null,0]
["4. Szczegóły",null,2,null,null,null,0]
[null,null,null,null,null,null,{"$f":"ROUND(SUM(G27:G32)*(J25+1),0)","v":0}]

{"sheet":"19","index":19,"n_rows":33,"n_cols":15,"rows_kept":33,"cut":false,"hidden":false,"merged":[[0,1,0,3],[1,1,1,3],[2,1,2,3],[31,0,31,1],[5,7,5,10],[5,11,5,14],[24,0,24,1],[24,3,24,6],[5,3,5,6],[29,0,29,1],[30,0,30,1],[28,0,28,1],[25,0,25,1],[27,0,27,1],[6,0,6,1],[7,0,7,1],[8,0,8,1],[9,0,9,1],[10,0,10,1],[17,0,17,1],[26,0,26,1],[25,8,25,10],[11,0,11,1],[12,0,12,1],[13,0,13,1],[14,0,14,1],[15,0,15,1],[18,0,18,1],[19,0,19,1]]}
["Nazwisko:",{"$f":"VLOOKUP(19,'Lista startowa F4H-P'!$A$5:$C$29,3,FALSE)","v":"Pilot 19"}]
["Model:",{"$f":"VLOOKUP(19,'Lista startowa F4H-P'!$A$5:$D$29,4,FALSE)","v":"Model 19"}]
["Nr Startowy:",{"$f":"VLOOKUP(19,'Lista startowa F4H-P'!$A$5:$C$29,2,FALSE)","v":19}]
[null,null,null,"S:",{"$f":"G33","v":0},"L1:",{"$f":"G21","v":0},"L2:",{"$f":"K21","v":0},"L3:",{"$f":"O21","v":0},"WL:",{"$f":"B22","v":0},"W:",{"$f":"B22+G33","v":0}]
[]
[null,null,null,"I Kolejka",null,null,null,"II Kolejka",null,null,null,"III Kolejka"]
["Program lotu",null,"K","Sędzia I","Sędzia II","Sędzia III","Wynik","Sędzia I","Sędzia II","Sędzia III","Wynik","Sędzia I","Sędzia II","Sędzia III","Wynik"]
["Start",null,11,null,null,null,{"$f":"$C8*(D8+E8+F8)","v":0},null,null,null,{"$f":"$C8*(H8+I8+J8)","v":0},null,null,null,{"$f":"$C8*(L8+M8+N8)","v":0}]
["Pokaz dowolny",null,7,null,null,null,0,null,null,null,0,null,null,null,0]
["Pokaz dowolny",null,7,null,null,null,0,null,null,null,0,null,null,null,0]
["Pokaz dowolny",null,7,null,null,null,0,null,null,null,0,null,null,null,0]
["Pokaz dowolny",null,7,null,null,null,0,null,null,null,0,null,null,null,0]
["Pokaz dowolny",null,7,null,null,null,0,null,null,null,0,null,null,null,0]
["Pokaz dowolny",null,7,null,null,null,0,null,null,null,0,null,null,null,0]
["Pokaz dowolny",null,7,null,null,null,0,null,null,null,0,null,null,null,0]
["Pokaz dowolny",null,7,null,null,null,0,null,null,null,0,null,null,null,0]
["Podejście do lądowania i lądowanie",null,11,null,null,null,0,null,null,null,0,null,null,null,0]
["Realizm lotu\na) Prezentacja lotu",null,4,null,null,null,{"$f":"$C18*(D18+E18+F18)","v":0},null,null,null,{"$f":"$C18*(H18+I18+J18)","v":0},null,null,null,{"$f":"$C18*(L18+M18+N18)","v":0}]
["b) Prędkość modelu",null,9,null,null,null,{"$f":"$C19*(D19+E19+F19)","v":0},null,null,null,{"$f":"$C19*(H19+I19+J19)","v":0},null,null,null,{"$f":"$C19*(L19+M19+N19)","v":0}]
["c) Płynność lotu",null,9,null,null,null,{"$f":"$C20*(D20+E20+F20)","v":0},null,null,null,{"$f":"$C20*(H20+I20+J20)","v":0},null,null,null,{"$f":"$C20*(L20+M20+N20)","v":0}]
[null,null,null,null,null,null,{"$f":"SUM(G8:G20)","v":0},null,null,null,{"$f":"SUM(K8:K20)","v":0},null,null,null,{"$f":"SUM(O8:O20)","v":0}]
["Wynik lotów:",{"$f":"IF('Lista startowa F4H-P'!H1>1,ROUND(((G21+K21+O21)-MIN(G21,K21,O21))/2,0),G21)","v":0}]
[]
[]
["Ocena statyczna (F4H-P)",null,"K","Ocena statyczna",null,null,null,null,"Bonus:"]
["1. Dokładność odwzorowania w skali",null,null,"Sędzia I","Sędzia II","Sędzia III","Wynik",null,"Model wykonany od podstaw",null,null,0.2]
["Widok z boku ",null,4,null,null,null,{"$f":"$C27*(D27+E27+F27)","v":0}]
["Widok z góry",null,4,null,null,null,0]
["Widok z przodu/tyłu",null,4,null,null,null,0]
["2. Kolorystyka",null,7,null,null,null,0]
["3. Oznakowanie",null,4,null,null,null,0]
["4. Szczegóły",null,2,null,null,null,0]
[null,null,null,null,null,null,{"$f":"ROUND(SUM(G27:G32)*(J25+1),0)","v":0}]

{"sheet":"20","index":20,"n_rows":33,"n_cols":15,"rows_kept":33,"cut":false,"hidden":false,"merged":[[18,0,18,1],[19,0,19,1],[0,1,0,3],[1,1,1,3],[2,1,2,3],[11,0,11,1],[12,0,12,1],[13,0,13,1],[14,0,14,1],[15,0,15,1],[31,0,31,1],[29,0,29,1],[30,0,30,1],[25,0,25,1],[28,0,28,1],[26,0,26,1],[27,0,27,1],[17,0,17,1],[25,8,25,10],[5,7,5,10],[5,11,5,14],[24,0,24,1],[24,3,24,6],[5,3,5,6],[6,0,6,1],[7,0,7,1],[8,0,8,1],[9,0,9,1],[10,0,10,1]]}
["Nazwisko:",{"$f":"VLOOKUP(20,'Lista startowa F4H-P'!$A$5:$C$29,3,FALSE)","v":"Pilot 20"}]
["Model:",{"$f":"VLOOKUP(20,'Lista startowa F4H-P'!$A$5:$D$29,4,FALSE)","v":"Model 20"}]
["Nr Startowy:",{"$f":"VLOOKUP(20,'Lista startowa F4H-P'!$A$5:$C$29,2,FALSE)","v":20}]
[null,null,null,"S:",{"$f":"G33","v":0},"L1:",{"$f":"G21","v":0},"L2:",{"$f":"K21","v":0},"L3:",{"$f":"O21","v":0},"WL:",{"$f":"B22","v":0},"W:",{"$f":"B22+G33","v":0}]
[]
[null,null,null,"I Kolejka",null,null,null,"II Kolejka",null,null,null,"III Kolejka"]
["Program lotu",null,"K","Sędzia I","Sędzia II","Sędzia III","Wynik","Sędzia I","Sędzia II","Sędzia III","Wynik","Sędzia I","Sędzia II","Sędzia III","Wynik"]
["Start",null,11,null,null,null,{"$f":"$C8*(D8+E8+F8)","v":0},null,null,null,{"$f":"$C8*(H8+I8+J8)","v":0},null,null,null,{"$f":"$C8*(L8+M8+N8)","v":0}]
["Pokaz dowolny",null,7,null,null,null,0,null,null,null,0,null,null,null,0]
["Pokaz dowolny",null,7,null,null,null,0,null,null,null,0,null,null,null,0]
["Pokaz dowolny",null,7,null,null,null,0,null,null,null,0,null,null,null,0]
["Pokaz dowolny",null,7,null,null,null,0,null,null,null,0,null,null,null,0]
["Pokaz dowolny",null,7,null,null,null,0,null,null,null,0,null,null,null,0]
["Pokaz dowolny",null,7,null,null,null,0,null,null,null,0,null,null,null,0]
["Pokaz dowolny",null,7,null,null,null,0,null,null,null,0,null,null,null,0]
["Pokaz dowolny",null,7,null,null,null,0,null,null,null,0,null,null,null,0]
["Podejście do lądowania i lądowanie",null,11,null,null,null,0,null,null,null,0,null,null,null,0]
["Realizm lotu\na) Prezentacja lotu",null,4,null,null,null,{"$f":"$C18*(D18+E18+F18)","v":0},null,null,null,{"$f":"$C18*(H18+I18+J18)","v":0},null,null,null,{"$f":"$C18*(L18+M18+N18)","v":0}]
["b) Prędkość modelu",null,9,null,null,null,{"$f":"$C19*(D19+E19+F19)","v":0},null,null,null,{"$f":"$C19*(H19+I19+J19)","v":0},null,null,null,{"$f":"$C19*(L19+M19+N19)","v":0}]
["c) Płynność lotu",null,9,null,null,null,{"$f":"$C20*(D20+E20+F20)","v":0},null,null,null,{"$f":"$C20*(H20+I20+J20)","v":0},null,null,null,{"$f":"$C20*(L20+M20+N20)","v":0}]
[null,null,null,null,null,null,{"$f":"SUM(G8:G20)","v":0},null,null,null,{"$f":"SUM(K8:K20)","v":0},null,null,null,{"$f":"SUM(O8:O20)","v":0}]
["Wynik lotów:",{"$f":"IF('Lista startowa F4H-P'!H1>1,ROUND(((G21+K21+O21)-MIN(G21,K21,O21))/2,0),G21)","v":0}]
[]
[]
["Ocena statyczna (F4H-P)",null,"K","Ocena statyczna",null,null,null,null,"Bonus:"]
["1. Dokładność odwzorowania w skali",null,null,"Sędzia I","Sędzia II","Sędzia III","Wynik",null,"Model wykonany od podstaw",null,null,0.2]
["Widok z boku ",null,4,null,null,null,{"$f":"$C27*(D27+E27+F27)","v":0}]
["Widok z góry",null,4,null,null,null,0]
["Widok z przodu/tyłu",null,4,null,null,null,0]
["2. Kolorystyka",null,7,null,null,null,0]
["3. Oznakowanie",null,4,null,null,null,0]
["4. Szczegóły",null,2,null,null,null,0]
[null,null,null,null,null,null,{"$f":"ROUND(SUM(G27:G32)*(J25+1),0)","v":0}]

{"sheet":"21","index":21,"n_rows":33,"n_cols":15,"rows_kept":33,"cut":false,"hidden":false,"merged":[[0,1,0,3],[1,1,1,3],[2,1,2,3],[31,0,31,1],[5,7,5,10],[5,11,5,14],[24,0,24,1],[24,3,24,6],[5,3,5,6],[29,0,29,1],[30,0,30,1],[28,0,28,1],[25,0,25,1],[27,0,27,1],[6,0,6,1],[7,0,7,1],[8,0,8,1],[9,0,9,1],[10,0,10,1],[17,0,17,1],[26,0,26,1],[25,8,25,10],[11,0,11,1],[12,0,12,1],[13,0,13,1],[14,0,14,1],[15,0,15,1],[18,0,18,1],[19,0,19,1]]}
["Nazwisko:",{"$f":"VLOOKUP(21,'Lista startowa F4H-P'!$A$5:$C$29,3,FALSE)","v":"Pilot 21"}]
["Model:",{"$f":"VLOOKUP(21,'Lista startowa F4H-P'!$A$5:$D$29,4,FALSE)","v":"Model 21"}]
["Nr Startowy:",{"$f":"VLOOKUP(21,'Lista startowa F4H-P'!$A$5:$C$29,2,FALSE)","v":21}]
[null,null,null,"S:",{"$f":"G33","v":0},"L1:",{"$f":"G21","v":0},"L2:",{"$f":"K21","v":0},"L3:",{"$f":"O21","v":0},"WL:",{"$f":"B22","v":0},"W:",{"$f":"B22+G33","v":0}]
[]
[null,null,null,"I Kolejka",null,null,null,"II Kolejka",null,null,null,"III Kolejka"]
["Program lotu",null,"K","Sędzia I","Sędzia II","Sędzia III","Wynik","Sędzia I","Sędzia II","Sędzia III","Wynik","Sędzia I","Sędzia II","Sędzia III","Wynik"]
["Start",null,11,null,null,null,{"$f":"$C8*(D8+E8+F8)","v":0},null,null,null,{"$f":"$C8*(H8+I8+J8)","v":0},null,null,null,{"$f":"$C8*(L8+M8+N8)","v":0}]
["Pokaz dowolny",null,7,null,null,null,0,null,null,null,0,null,null,null,0]
["Pokaz dowolny",null,7,null,null,null,0,null,null,null,0,null,null,null,0]
["Pokaz dowolny",null,7,null,null,null,0,null,null,null,0,null,null,null,0]
["Pokaz dowolny",null,7,null,null,null,0,null,null,null,0,null,null,null,0]
["Pokaz dowolny",null,7,null,null,null,0,null,null,null,0,null,null,null,0]
["Pokaz dowolny",null,7,null,null,null,0,null,null,null,0,null,null,null,0]
["Pokaz dowolny",null,7,null,null,null,0,null,null,null,0,null,null,null,0]
["Pokaz dowolny",null,7,null,null,null,0,null,null,null,0,null,null,null,0]
["Podejście do lądowania i lądowanie",null,11,null,null,null,0,null,null,null,0,null,null,null,0]
["Realizm lotu\na) Prezentacja lotu",null,4,null,null,null,{"$f":"$C18*(D18+E18+F18)","v":0},null,null,null,{"$f":"$C18*(H18+I18+J18)","v":0},null,null,null,{"$f":"$C18*(L18+M18+N18)","v":0}]
["b) Prędkość modelu",null,9,null,null,null,{"$f":"$C19*(D19+E19+F19)","v":0},null,null,null,{"$f":"$C19*(H19+I19+J19)","v":0},null,null,null,{"$f":"$C19*(L19+M19+N19)","v":0}]
["c) Płynność lotu",null,9,null,null,null,{"$f":"$C20*(D20+E20+F20)","v":0},null,null,null,{"$f":"$C20*(H20+I20+J20)","v":0},null,null,null,{"$f":"$C20*(L20+M20+N20)","v":0}]
[null,null,null,null,null,null,{"$f":"SUM(G8:G20)","v":0},null,null,null,{"$f":"SUM(K8:K20)","v":0},null,null,null,{"$f":"SUM(O8:O20)","v":0}]
["Wynik lotów:",{"$f":"IF('Lista startowa F4H-P'!H1>1,ROUND(((G21+K21+O21)-MIN(G21,K21,O21))/2,0),G21)","v":0}]
[]
[]
["Ocena statyczna (F4H-P)",null,"K","Ocena statyczna",null,null,null,null,"Bonus:"]
["1. Dokładność odwzorowania w skali",null,null,"Sędzia I","Sędzia II","Sędzia III","Wynik",null,"Model wykonany od podstaw",null,null,0.2]
["Widok z boku ",null,4,null,null,null,{"$f":"$C27*(D27+E27+F27)","v":0}]
["Widok z góry",null,4,null,null,null,0]
["Widok z przodu/tyłu",null,4,null,null,null,0]
["2. Kolorystyka",null,7,null,null,null,0]
["3. Oznakowanie",null,4,null,null,null,0]
["4. Szczegóły",null,2,null,null,null,0]
[null,null,null,null,null,null,{"$f":"ROUND(SUM(G27:G32)*(J25+1),0)","v":0}]

{"sheet":"22","index":22,"n_rows":33,"n_cols":15,"rows_kept":33,"cut":false,"hidden":false,"merged":[[0,1,0,3],[1,1,1,3],[2,1,2,3],[17,0,17,1],[6,0,6,1],[7,0,7,1],[8,0,8,1],[9,0,9,1],[10,0,10,1],[11,0,11,1],[12,0,12,1],[13,0,13,1],[14,0,14,1],[15,0,15,1],[18,0,18,1],[31,0,31,1],[5,7,5,10],[5,11,5,14],[24,0,24,1],[24,3,24,6],[5,3,5,6],[29,0,29,1],[30,0,30,1],[28,0,28,1],[25,0,25,1],[26,0,26,1],[27,0,27,1],[25,8,25,10],[19,0,19,1]]}
["Nazwisko:",{"$f":"VLOOKUP(22,'Lista startowa F4H-P'!$A$5:$C$29,3,FALSE)","v":"Pilot 22"}]
["Model:",{"$f":"VLOOKUP(22,'Lista startowa F4H-P'!$A$5:$D$29,4,FALSE)","v":"Model 22"}]
["Nr Startowy:",{"$f":"VLOOKUP(22,'Lista startowa F4H-P'!$A$5:$C$29,2,FALSE)","v":22}]
[null,null,null,"S:",{"$f":"G33","v":0},"L1:",{"$f":"G21","v":0},"L2:",{"$f":"K21","v":0},"L3:",{"$f":"O21","v":0},"WL:",{"$f":"B22","v":0},"W:",{"$f":"B22+G33","v":0}]
[]
[null,null,null,"I Kolejka",null,null,null,"II Kolejka",null,null,null,"III Kolejka"]
["Program lotu",null,"K","Sędzia I","Sędzia II","Sędzia III","Wynik","Sędzia I","Sędzia II","Sędzia III","Wynik","Sędzia I","Sędzia II","Sędzia III","Wynik"]
["Start",null,11,null,null,null,{"$f":"$C8*(D8+E8+F8)","v":0},null,null,null,{"$f":"$C8*(H8+I8+J8)","v":0},null,null,null,{"$f":"$C8*(L8+M8+N8)","v":0}]
["Pokaz dowolny",null,7,null,null,null,0,null,null,null,0,null,null,null,0]
["Pokaz dowolny",null,7,null,null,null,0,null,null,null,0,null,null,null,0]
["Pokaz dowolny",null,7,null,null,null,0,null,null,null,0,null,null,null,0]
["Pokaz dowolny",null,7,null,null,null,0,null,null,null,0,null,null,null,0]
["Pokaz dowolny",null,7,null,null,null,0,null,null,null,0,null,null,null,0]
["Pokaz dowolny",null,7,null,null,null,0,null,null,null,0,null,null,null,0]
["Pokaz dowolny",null,7,null,null,null,0,null,null,null,0,null,null,null,0]
["Pokaz dowolny",null,7,null,null,null,0,null,null,null,0,null,null,null,0]
["Podejście do lądowania i lądowanie",null,11,null,null,null,0,null,null,null,0,null,null,null,0]
["Realizm lotu\na) Prezentacja lotu",null,4,null,null,null,{"$f":"$C18*(D18+E18+F18)","v":0},null,null,null,{"$f":"$C18*(H18+I18+J18)","v":0},null,null,null,{"$f":"$C18*(L18+M18+N18)","v":0}]
["b) Prędkość modelu",null,9,null,null,null,{"$f":"$C19*(D19+E19+F19)","v":0},null,null,null,{"$f":"$C19*(H19+I19+J19)","v":0},null,null,null,{"$f":"$C19*(L19+M19+N19)","v":0}]
["c) Płynność lotu",null,9,null,null,null,{"$f":"$C20*(D20+E20+F20)","v":0},null,null,null,{"$f":"$C20*(H20+I20+J20)","v":0},null,null,null,{"$f":"$C20*(L20+M20+N20)","v":0}]
[null,null,null,null,null,null,{"$f":"SUM(G8:G20)","v":0},null,null,null,{"$f":"SUM(K8:K20)","v":0},null,null,null,{"$f":"SUM(O8:O20)","v":0}]
["Wynik lotów:",{"$f":"IF('Lista startowa F4H-P'!H1>1,ROUND(((G21+K21+O21)-MIN(G21,K21,O21))/2,0),G21)","v":0}]
[]
[]
["Ocena statyczna (F4H-P)",null,"K","Ocena statyczna",null,null,null,null,"Bonus:"]
["1. Dokładność odwzorowania w skali",null,null,"Sędzia I","Sędzia II","Sędzia III","Wynik",null,"Model wykonany od podstaw",null,null,0.2]
["Widok z boku ",null,4,null,null,null,{"$f":"$C27*(D27+E27+F27)","v":0}]
["Widok z góry",null,4,null,null,null,0]
["Widok z przodu/tyłu",null,4,null,null,null,0]
["2. Kolorystyka",null,7,null,null,null,0]
["3. Oznakowanie",null,4,null,null,null,0]
["4. Szczegóły",null,2,null,null,null,0]
[null,null,null,null,null,null,{"$f":"ROUND(SUM(G27:G32)*(J25+1),0)","v":0}]

{"sheet":"23","index":23,"n_rows":33,"n_cols":15,"rows_kept":33,"cut":false,"hidden":false,"merged":[[0,1,0,3],[1,1,1,3],[2,1,2,3],[31,0,31,1],[5,7,5,10],[5,11,5,14],[24,0,24,1],[24,3,24,6],[5,3,5,6],[29,0,29,1],[30,0,30,1],[28,0,28,1],[25,0,25,1],[27,0,27,1],[6,0,6,1],[7,0,7,1],[8,0,8,1],[9,0,9,1],[10,0,10,1],[17,0,17,1],[26,0,26,1],[25,8,25,10],[11,0,11,1],[12,0,12,1],[13,0,13,1],[14,0,14,1],[15,0,15,1],[18,0,18,1],[19,0,19,1]]}
["Nazwisko:",{"$f":"VLOOKUP(23,'Lista startowa F4H-P'!$A$5:$C$29,3,FALSE)","v":"Pilot 23"}]
["Model:",{"$f":"VLOOKUP(23,'Lista startowa F4H-P'!$A$5:$D$29,4,FALSE)","v":"Model 23"}]
["Nr Startowy:",{"$f":"VLOOKUP(23,'Lista startowa F4H-P'!$A$5:$C$29,2,FALSE)","v":23}]
[null,null,null,"S:",{"$f":"G33","v":0},"L1:",{"$f":"G21","v":0},"L2:",{"$f":"K21","v":0},"L3:",{"$f":"O21","v":0},"WL:",{"$f":"B22","v":0},"W:",{"$f":"B22+G33","v":0}]
[]
[null,null,null,"I Kolejka",null,null,null,"II Kolejka",null,null,null,"III Kolejka"]
["Program lotu",null,"K","Sędzia I","Sędzia II","Sędzia III","Wynik","Sędzia I","Sędzia II","Sędzia III","Wynik","Sędzia I","Sędzia II","Sędzia III","Wynik"]
["Start",null,11,null,null,null,{"$f":"$C8*(D8+E8+F8)","v":0},null,null,null,{"$f":"$C8*(H8+I8+J8)","v":0},null,null,null,{"$f":"$C8*(L8+M8+N8)","v":0}]
["Pokaz dowolny",null,7,null,null,null,0,null,null,null,0,null,null,null,0]
["Pokaz dowolny",null,7,null,null,null,0,null,null,null,0,null,null,null,0]
["Pokaz dowolny",null,7,null,null,null,0,null,null,null,0,null,null,null,0]
["Pokaz dowolny",null,7,null,null,null,0,null,null,null,0,null,null,null,0]
["Pokaz dowolny",null,7,null,null,null,0,null,null,null,0,null,null,null,0]
["Pokaz dowolny",null,7,null,null,null,0,null,null,null,0,null,null,null,0]
["Pokaz dowolny",null,7,null,null,null,0,null,null,null,0,null,null,null,0]
["Pokaz dowolny",null,7,null,null,null,0,null,null,null,0,null,null,null,0]
["Podejście do lądowania i lądowanie",null,11,null,null,null,0,null,null,null,0,null,null,null,0]
["Realizm lotu\na) Prezentacja lotu",null,4,null,null,null,{"$f":"$C18*(D18+E18+F18)","v":0},null,null,null,{"$f":"$C18*(H18+I18+J18)","v":0},null,null,null,{"$f":"$C18*(L18+M18+N18)","v":0}]
["b) Prędkość modelu",null,9,null,null,null,{"$f":"$C19*(D19+E19+F19)","v":0},null,null,null,{"$f":"$C19*(H19+I19+J19)","v":0},null,null,null,{"$f":"$C19*(L19+M19+N19)","v":0}]
["c) Płynność lotu",null,9,null,null,null,{"$f":"$C20*(D20+E20+F20)","v":0},null,null,null,{"$f":"$C20*(H20+I20+J20)","v":0},null,null,null,{"$f":"$C20*(L20+M20+N20)","v":0}]
[null,null,null,null,null,null,{"$f":"SUM(G8:G20)","v":0},null,null,null,{"$f":"SUM(K8:K20)","v":0},null,null,null,{"$f":"SUM(O8:O20)","v":0}]
["Wynik lotów:",{"$f":"IF('Lista startowa F4H-P'!H1>1,ROUND(((G21+K21+O21)-MIN(G21,K21,O21))/2,0),G21)","v":0}]
[]
[]
["Ocena statyczna (F4H-P)",null,"K","Ocena statyczna",null,null,null,null,"Bonus:"]
["1. Dokładność odwzorowania w skali",null,null,"Sędzia I","Sędzia II","Sędzia III","Wynik",null,"Model wykonany od podstaw",null,null,0.2]
["Widok z boku ",null,4,null,null,null,{"$f":"$C27*(D27+E27+F27)","v":0}]
["Widok z góry",null,4,null,null,null,0]
["Widok z przodu/tyłu",null,4,null,null,null,0]
["2. Kolorystyka",null,7,null,null,null,0]
["3. Oznakowanie",null,4,null,null,null,0]
["4. Szczegóły",null,2,null,null,null,0]
[null,null,null,null,null,null,{"$f":"ROUND(SUM(G27:G32)*(J25+1),0)","v":0}]

{"sheet":"24","index":24,"n_rows":33,"n_cols":15,"rows_kept":33,"cut":false,"hidden":false,"merged":[[0,1,0,3],[1,1,1,3],[2,1,2,3],[17,0,17,1],[6,0,6,1],[7,0,7,1],[8,0,8,1],[9,0,9,1],[10,0,10,1],[11,0,11,1],[12,0,12,1],[13,0,13,1],[14,0,14,1],[15,0,15,1],[18,0,18,1],[31,0,31,1],[5,7,5,10],[5,11,5,14],[24,0,24,1],[24,3,24,6],[5,3,5,6],[29,0,29,1],[30,0,30,1],[28,0,28,1],[25,0,25,1],[26,0,26,1],[27,0,27,1],[25,8,25,10],[19,0,19,1]]}
["Nazwisko:",{"$f":"VLOOKUP(24,'Lista startowa F4H-P'!$A$5:$C$29,3,FALSE)","v":"Pilot 24"}]
["Model:",{"$f":"VLOOKUP(24,'Lista startowa F4H-P'!$A$5:$D$29,4,FALSE)","v":"Model 24"}]
["Nr Startowy:",{"$f":"VLOOKUP(24,'Lista startowa F4H-P'!$A$5:$C$29,2,FALSE)","v":24}]
[null,null,null,"S:",{"$f":"G33","v":0},"L1:",{"$f":"G21","v":0},"L2:",{"$f":"K21","v":0},"L3:",{"$f":"O21","v":0},"WL:",{"$f":"B22","v":0},"W:",{"$f":"B22+G33","v":0}]
[]
[null,null,null,"I Kolejka",null,null,null,"II Kolejka",null,null,null,"III Kolejka"]
["Program lotu",null,"K","Sędzia I","Sędzia II","Sędzia III","Wynik","Sędzia I","Sędzia II","Sędzia III","Wynik","Sędzia I","Sędzia II","Sędzia III","Wynik"]
["Start",null,11,null,null,null,{"$f":"$C8*(D8+E8+F8)","v":0},null,null,null,{"$f":"$C8*(H8+I8+J8)","v":0},null,null,null,{"$f":"$C8*(L8+M8+N8)","v":0}]
["Pokaz dowolny",null,7,null,null,null,0,null,null,null,0,null,null,null,0]
["Pokaz dowolny",null,7,null,null,null,0,null,null,null,0,null,null,null,0]
["Pokaz dowolny",null,7,null,null,null,0,null,null,null,0,null,null,null,0]
["Pokaz dowolny",null,7,null,null,null,0,null,null,null,0,null,null,null,0]
["Pokaz dowolny",null,7,null,null,null,0,null,null,null,0,null,null,null,0]
["Pokaz dowolny",null,7,null,null,null,0,null,null,null,0,null,null,null,0]
["Pokaz dowolny",null,7,null,null,null,0,null,null,null,0,null,null,null,0]
["Pokaz dowolny",null,7,null,null,null,0,null,null,null,0,null,null,null,0]
["Podejście do lądowania i lądowanie",null,11,null,null,null,0,null,null,null,0,null,null,null,0]
["Realizm lotu\na) Prezentacja lotu",null,4,null,null,null,{"$f":"$C18*(D18+E18+F18)","v":0},null,null,null,{"$f":"$C18*(H18+I18+J18)","v":0},null,null,null,{"$f":"$C18*(L18+M18+N18)","v":0}]
["b) Prędkość modelu",null,9,null,null,null,{"$f":"$C19*(D19+E19+F19)","v":0},null,null,null,{"$f":"$C19*(H19+I19+J19)","v":0},null,null,null,{"$f":"$C19*(L19+M19+N19)","v":0}]
["c) Płynność lotu",null,9,null,null,null,{"$f":"$C20*(D20+E20+F20)","v":0},null,null,null,{"$f":"$C20*(H20+I20+J20)","v":0},null,null,null,{"$f":"$C20*(L20+M20+N20)","v":0}]
[null,null,null,null,null,null,{"$f":"SUM(G8:G20)","v":0},null,null,null,{"$f":"SUM(K8:K20)","v":0},null,null,null,{"$f":"SUM(O8:O20)","v":0}]
["Wynik lotów:",{"$f":"IF('Lista startowa F4H-P'!H1>1,ROUND(((G21+K21+O21)-MIN(G21,K21,O21))/2,0),G21)","v":0}]
[]
[]
["Ocena statyczna (F4H-P)",null,"K","Ocena statyczna",null,null,null,null,"Bonus:"]
["1. Dokładność odwzorowania w skali",null,null,"Sędzia I","Sędzia II","Sędzia III","Wynik",null,"Model wykonany od podstaw",null,null,0.2]
["Widok z boku ",null,4,null,null,null,{"$f":"$C27*(D27+E27+F27)","v":0}]
["Widok z góry",null,4,null,null,null,0]
["Widok z przodu/tyłu",null,4,null,null,null,0]
["2. Kolorystyka",null,7,null,null,null,0]
["3. Oznakowanie",null,4,null,null,null,0]
["4. Szczegóły",null,2,null,null,null,0]
[null,null,null,null,null,null,{"$f":"ROUND(SUM(G27:G32)*(J25+1),0)","v":0}]

{"sheet":"25","index":25,"n_rows":33,"n_cols":15,"rows_kept":33,"cut":false,"hidden":false,"merged":[[0,1,0,3],[1,1,1,3],[2,1,2,3],[31,0,31,1],[5,7,5,10],[5,11,5,14],[24,0,24,1],[24,3,24,6],[5,3,5,6],[29,0,29,1],[30,0,30,1],[28,0,28,1],[25,0,25,1],[27,0,27,1],[6,0,6,1],[7,0,7,1],[8,0,8,1],[9,0,9,1],[10,0,10,1],[17,0,17,1],[26,0,26,1],[25,8,25,10],[11,0,11,1],[12,0,12,1],[13,0,13,1],[14,0,14,1],[15,0,15,1],[18,0,18,1],[19,0,19,1]]}
["Nazwisko:",{"$f":"VLOOKUP(25,'Lista startowa F4H-P'!$A$5:$C$29,3,FALSE)","v":"Pilot 25"}]
["Model:",{"$f":"VLOOKUP(25,'Lista startowa F4H-P'!$A$5:$D$29,4,FALSE)","v":"Model 25"}]
["Nr Startowy:",{"$f":"VLOOKUP(25,'Lista startowa F4H-P'!$A$5:$C$29,2,FALSE)","v":25}]
[null,null,null,"S:",{"$f":"G33","v":0},"L1:",{"$f":"G21","v":0},"L2:",{"$f":"K21","v":0},"L3:",{"$f":"O21","v":0},"WL:",{"$f":"B22","v":0},"W:",{"$f":"B22+G33","v":0}]
[]
[null,null,null,"I Kolejka",null,null,null,"II Kolejka",null,null,null,"III Kolejka"]
["Program lotu",null,"K","Sędzia I","Sędzia II","Sędzia III","Wynik","Sędzia I","Sędzia II","Sędzia III","Wynik","Sędzia I","Sędzia II","Sędzia III","Wynik"]
["Start",null,11,null,null,null,{"$f":"$C8*(D8+E8+F8)","v":0},null,null,null,{"$f":"$C8*(H8+I8+J8)","v":0},null,null,null,{"$f":"$C8*(L8+M8+N8)","v":0}]
["Pokaz dowolny",null,7,null,null,null,0,null,null,null,0,null,null,null,0]
["Pokaz dowolny",null,7,null,null,null,0,null,null,null,0,null,null,null,0]
["Pokaz dowolny",null,7,null,null,null,0,null,null,null,0,null,null,null,0]
["Pokaz dowolny",null,7,null,null,null,0,null,null,null,0,null,null,null,0]
["Pokaz dowolny",null,7,null,null,null,0,null,null,null,0,null,null,null,0]
["Pokaz dowolny",null,7,null,null,null,0,null,null,null,0,null,null,null,0]
["Pokaz dowolny",null,7,null,null,null,0,null,null,null,0,null,null,null,0]
["Pokaz dowolny",null,7,null,null,null,0,null,null,null,0,null,null,null,0]
["Podejście do lądowania i lądowanie",null,11,null,null,null,0,null,null,null,0,null,null,null,0]
["Realizm lotu\na) Prezentacja lotu",null,4,null,null,null,{"$f":"$C18*(D18+E18+F18)","v":0},null,null,null,{"$f":"$C18*(H18+I18+J18)","v":0},null,null,null,{"$f":"$C18*(L18+M18+N18)","v":0}]
["b) Prędkość modelu",null,9,null,null,null,{"$f":"$C19*(D19+E19+F19)","v":0},null,null,null,{"$f":"$C19*(H19+I19+J19)","v":0},null,null,null,{"$f":"$C19*(L19+M19+N19)","v":0}]
["c) Płynność lotu",null,9,null,null,null,{"$f":"$C20*(D20+E20+F20)","v":0},null,null,null,{"$f":"$C20*(H20+I20+J20)","v":0},null,null,null,{"$f":"$C20*(L20+M20+N20)","v":0}]
[null,null,null,null,null,null,{"$f":"SUM(G8:G20)","v":0},null,null,null,{"$f":"SUM(K8:K20)","v":0},null,null,null,{"$f":"SUM(O8:O20)","v":0}]
["Wynik lotów:",{"$f":"IF('Lista startowa F4H-P'!H1>1,ROUND(((G21+K21+O21)-MIN(G21,K21,O21))/2,0),G21)","v":0}]
[]
[]
["Ocena statyczna (F4H-P)",null,"K","Ocena statyczna",null,null,null,null,"Bonus:"]
["1. Dokładność odwzorowania w skali",null,null,"Sędzia I","Sędzia II","Sędzia III","Wynik",null,"Model wykonany od podstaw",null,null,0.2]
["Widok z boku ",null,4,null,null,null,{"$f":"$C27*(D27+E27+F27)","v":0}]
["Widok z góry",null,4,null,null,null,0]
["Widok z przodu/tyłu",null,4,null,null,null,0]
["2. Kolorystyka",null,7,null,null,null,0]
["3. Oznakowanie",null,4,null,null,null,0]
["4. Szczegóły",null,2,null,null,null,0]
[null,null,null,null,null,null,{"$f":"ROUND(SUM(G27:G32)*(J25+1),0)","v":0}]