{"text_format":"1","workbook":"xlsx","n_sheets":26,"sheets":["Lista startowa F4H-P","1","2","3","4","5","6","7","8","9","10","11","12","13","14","15","16","17","18","19","20","21","22","23","24","25"],"not_rendered":{"charts":0,"images":0,"macros":1,"external_links":0,"defined_names":27,"comments":0,"pivot_tables":0},"unopened":[],"bounds":{"document_bytes":16777216,"sheet_cells":100000,"rows_first":2000,"rows_last":500,"rows_between":2000,"halvings":0,"cell_chars":16384,"cell_head_chars":4096},"cells_cut":0,"cells_raw":0,"read":"whole","date_system":"1900"}

{"sheet":"Lista startowa F4H-P","index":0,"n_rows":33,"n_cols":27,"rows_kept":33,"cut":false,"hidden":false,"merged":[[2,5,2,7],[0,5,1,6],[0,7,1,7]]}
["Lista startowa F4H-P",null,null,null,null,"Liczba punktowanych kolejek:",null,2,null,null,null,null,null,null,null,null,null,null,null,null,null,null,null,null,null,null,1]
[null,null,null,null,null,null,null,null,null,null,null,null,null,null,null,null,null,null,null,null,null,null,null,null,null,null,2]
[null,null,null,null,null,"Loty"]
["Lp.","Nr startowy","Imię i Nazwisko","Model","O.\n statyczna","I \nKolejka","II \nKolejka","III\n Kolejka","Wynik\n Lotów","Wynik"]
[1,1,"Pilot 1","Model 1",{"$f":"'1'!$G$33","v":0},{"$f":"'1'!$G$21","v":0},{"$f":"'1'!$K$21","v":0},{"$f":"'1'!$O$21","v":0},{"$f":"'1'!$B$22","v":0},{"$f":"'1'!$O$4","v":0}]
[2,2,"Pilot 2","Model 2",{"$f":"'2'!$G$33","v":0},{"$f":"'2'!$G$21","v":0},{"$f":"'2'!$K$21","v":0},{"$f":"'2'!$O$21","v":0},{"$f":"'2'!$B$22","v":0},{"$f":"'2'!$O$4","v":0}]
{"$rows_left_out":28}
{"sheet":"1","index":1,"n_rows":33,"n_cols":15,"rows_kept":33,"cut":false,"hidden":false,"merged":[[0,1,0,3],[1,1,1,3],[2,1,2,3],[31,0,31,1],[5,7,5,10],[5,11,5,14],[24,0,24,1],[24,3,24,6],[5,3,5,6],[29,0,29,1],[30,0,30,1],[28,0,28,1],[25,0,25,1],[27,0,27,1],[6,0,6,1],[7,0,7,1],[8,0,8,1],[9,0,9,1],[10,0,10,1],[17,0,17,1],[26,0,26,1],[25,8,25,10],[11,0,11,1],[12,0,12,1],[13,0,13,1],[14,0,14,1],[15,0,15,1],[18,0,18,1],[19,0,19,1]]}
["Nazwisko:",{"$f":"VLOOKUP(1,'Lista startowa F4H-P'!$A$5:$C$29,3,FALSE)","v":"Pilot 1"}]
["Model:",{"$f":"VLOOKUP(1,'Lista startowa F4H-P'!$A$5:$D$29,4,FALSE)","v":"Model 1"}]
["Nr Startowy:",{"$f":"VLOOKUP(1,'Lista startowa F4H-P'!$A$5:$C$29,2,FALSE)","v":1}]
[null,null,null,"S:",{"$f":"G33","v":0},"L1:",{"$f":"G21","v":0},"L2:",{"$f":"K21","v":0},"L3:",{"$f":"O21","v":0},"WL:",{"$f":"B22","v":0},"W:",{"$f":"B22+G33","v":0}]
[]
[null,null,null,"I Kolejka",null,null,null,"II Kolejka",null,null,null,"III Kolejka"]
{"$rows_left_out":28}
{"sheet":"2","index":2,"n_rows":33,"n_cols":15,"rows_kept":33,"cut":false,"hidden":false,"merged":[[0,1,0,3],[1,1,1,3],[2,1,2,3],[17,0,17,1],[6,0,6,1],[7,0,7,1],[8,0,8,1],[9,0,9,1],[10,0,10,1],[11,0,11,1],[12,0,12,1],[13,0,13,1],[14,0,14,1],[15,0,15,1],[18,0,18,1],[31,0,31,1],[5,7,5,10],[5,11,5,14],[24,0,24,1],[24,3,24,6],[5,3,5,6],[29,0,29,1],[30,0,30,1],[28,0,28,1],[25,0,25,1],[26,0,26,1],[27,0,27,1],[25,8,25,10],[19,0,19,1]]}
["Nazwisko:",{"$f":"VLOOKUP(2,'Lista startowa F4H-P'!$A$5:$C$29,3,FALSE)","v":"Pilot 2"}]
["Model:",{"$f":"VLOOKUP(2,'Lista startowa F4H-P'!$A$5:$D$29,4,FALSE)","v":"Model 2"}]
["Nr Startowy:",{"$f":"VLOOKUP(2,'Lista startowa F4H-P'!$A$5:$C$29,2,FALSE)","v":2}]
[null,null,null,"S:",{"$f":"G33","v":0},"L1:",{"$f":"G21","v":0},"L2:",{"$f":"K21","v":0},"L3:",{"$f":"O21","v":0},"WL:",{"$f":"B22","v":0},"W:",{"$f":"B22+G33","v":0}]
[]
[null,null,null,"I Kolejka",null,null,null,"II Kolejka",null,null,null,"III Kolejka"]
{"$rows_left_out":28}
{"sheet":"3","index":3,"n_rows":33,"n_cols":15,"rows_kept":33,"cut":false,"hidden":false,"merged":[[0,1,0,3],[1,1,1,3],[2,1,2,3],[31,0,31,1],[5,7,5,10],[5,11,5,14],[24,0,24,1],[24,3,24,6],[5,3,5,6],[29,0,29,1],[30,0,30,1],[28,0,28,1],[25,0,25,1],[27,0,27,1],[6,0,6,1],[7,0,7,1],[8,0,8,1],[9,0,9,1],[10,0,10,1],[17,0,17,1],[26,0,26,1],[25,8,25,10],[11,0,11,1],[12,0,12,1],[13,0,13,1],[14,0,14,1],[15,0,15,1],[18,0,18,1],[19,0,19,1]]}
["Nazwisko:",{"$f":"VLOOKUP(3,'Lista startowa F4H-P'!$A$5:$C$29,3,FALSE)","v":"Pilot 3"}]
["Model:",{"$f":"VLOOKUP(3,'Lista startowa F4H-P'!$A$5:$D$29,4,FALSE)","v":"Model 3"}]
["Nr Startowy:",{"$f":"VLOOKUP(3,'Lista startowa F4H-P'!$A$5:$C$29,2,FALSE)","v":3}]
[null,null,null,"S:",{"$f":"G33","v":0},"L1:",{"$f":"G21","v":0},"L2:",{"$f":"K21","v":0},"L3:",{"$f":"O21","v":0},"WL:",{"$f":"B22","v":0},"W:",{"$f":"B22+G33","v":0}]
[]
[null,null,null,"I Kolejka",null,null,null,"II Kolejka",null,null,null,"III Kolejka"]
{"$rows_left_out":28}
{"sheet":"4","index":4,"n_rows":33,"n_cols":15,"rows_kept":33,"cut":false,"hidden":false,"merged":[[18,0,18,1],[19,0,19,1],[0,1,0,3],[1,1,1,3],[2,1,2,3],[11,0,11,1],[12,0,12,1],[13,0,13,1],[14,0,14,1],[15,0,15,1],[31,0,31,1],[29,0,29,1],[30,0,30,1],[25,0,25,1],[28,0,28,1],[26,0,26,1],[27,0,27,1],[17,0,17,1],[25,8,25,10],[5,7,5,10],[5,11,5,14],[24,0,24,1],[24,3,24,6],[5,3,5,6],[6,0,6,1],[7,0,7,1],[8,0,8,1],[9,0,9,1],[10,0,10,1]]}
["Nazwisko:",{"$f":"VLOOKUP(4,'Lista startowa F4H-P'!$A$5:$C$29,3,FALSE)","v":"Pilot 4"}]
["Model:",{"$f":"VLOOKUP(4,'Lista startowa F4H-P'!$A$5:$D$29,4,FALSE)","v":"Model 4"}]
["Nr Startowy:",{"$f":"VLOOKUP(4,'Lista startowa F4H-P'!$A$5:$C$29,2,FALSE)","v":4}]
[null,null,null,"S:",{"$f":"G33","v":0},"L1:",{"$f":"G21","v":0},"L2:",{"$f":"K21","v":0},"L3:",{"$f":"O21","v":0},"WL:",{"$f":"B22","v":0},"W:",{"$f":"B22+G33","v":0}]
[]
[null,null,null,"I Kolejka",null,null,null,"II Kolejka",null,null,null,"III Kolejka"]
{"$rows_left_out":28}
{"sheet":"5","index":5,"n_rows":33,"n_cols":15,"rows_kept":33,"cut":false,"hidden":false,"merged":[[0,1,0,3],[1,1,1,3],[2,1,2,3],[31,0,31,1],[5,7,5,10],[5,11,5,14],[24,0,24,1],[24,3,24,6],[5,3,5,6],[29,0,29,1],[30,0,30,1],[28,0,28,1],[25,0,25,1],[27,0,27,1],[6,0,6,1],[7,0,7,1],[8,0,8,1],[9,0,9,1],[10,0,10,1],[17,0,17,1],[26,0,26,1],[25,8,25,10],[11,0,11,1],[12,0,12,1],[13,0,13,1],[14,0,14,1],[15,0,15,1],[18,0,18,1],[19,0,19,1]]}
["Nazwisko:",{"$f":"VLOOKUP(5,'Lista startowa F4H-P'!$A$5:$C$29,3,FALSE)","v":"Pilot 5"}]
["Model:",{"$f":"VLOOKUP(5,'Lista startowa F4H-P'!$A$5:$D$29,4,FALSE)","v":"Model 5"}]
["Nr Startowy:",{"$f":"VLOOKUP(5,'Lista startowa F4H-P'!$A$5:$C$29,2,FALSE)","v":5}]
[null,null,null,"S:",{"$f":"G33","v":0},"L1:",{"$f":"G21","v":0},"L2:",{"$f":"K21","v":0},"L3:",{"$f":"O21","v":0},"WL:",{"$f":"B22","v":0},"W:",{"$f":"B22+G33","v":0}]
[]
[null,null,null,"I Kolejka",null,null,null,"II Kolejka",null,null,null,"III Kolejka"]
{"$rows_left_out":28}
{"sheet":"6","index":6,"n_rows":33,"n_cols":15,"rows_kept":33,"cut":false,"hidden":false,"merged":[[18,0,18,1],[19,0,19,1],[0,1,0,3],[1,1,1,3],[2,1,2,3],[11,0,11,1],[12,0,12,1],[13,0,13,1],[14,0,14,1],[15,0,15,1],[31,0,31,1],[29,0,29,1],[30,0,30,1],[25,0,25,1],[28,0,28,1],[26,0,26,1],[27,0,27,1],[17,0,17,1],[25,8,25,10],[5,7,5,10],[5,11,5,14],[24,0,24,1],[24,3,24,6],[5,3,5,6],[6,0,6,1],[7,0,7,1],[8,0,8,1],[9,0,9,1],[10,0,10,1]]}
["Nazwisko:",{"$f":"VLOOKUP(6,'Lista startowa F4H-P'!$A$5:$C$29,3,FALSE)","v":"Pilot 6"}]
["Model:",{"$f":"VLOOKUP(6,'Lista startowa F4H-P'!$A$5:$D$29,4,FALSE)","v":"Model 6"}]
["Nr Startowy:",{"$f":"VLOOKUP(6,'Lista startowa F4H-P'!$A$5:$C$29,2,FALSE)","v":6}]
[null,null,null,"S:",{"$f":"G33","v":0},"L1:",{"$f":"G21","v":0},"L2:",{"$f":"K21","v":0},"L3:",{"$f":"O21","v":0},"WL:",{"$f":"B22","v":0},"W:",{"$f":"B22+G33","v":0}]
[]
[null,null,null,"I Kolejka",null,null,null,"II Kolejka",null,null,null,"III Kolejka"]
{"$rows_left_out":28}
{"sheet":"7","index":7,"n_rows":33,"n_cols":15,"rows_kept":33,"cut":false,"hidden":false,"merged":[[0,1,0,3],[1,1,1,3],[2,1,2,3],[31,0,31,1],[5,7,5,10],[5,11,5,14],[24,0,24,1],[24,3,24,6],[5,3,5,6],[29,0,29,1],[30,0,30,1],[28,0,28,1],[25,0,25,1],[27,0,27,1],[6,0,6,1],[7,0,7,1],[8,0,8,1],[9,0,9,1],[10,0,10,1],[17,0,17,1],[26,0,26,1],[25,8,25,10],[11,0,11,1],[12,0,12,1],[13,0,13,1],[14,0,14,1],[15,0,15,1],[18,0,18,1],[19,0,19,1]]}
["Nazwisko:",{"$f":"VLOOKUP(7,'Lista startowa F4H-P'!$A$5:$C$29,3,FALSE)","v":"Pilot 7"}]
["Model:",{"$f":"VLOOKUP(7,'Lista startowa F4H-P'!$A$5:$D$29,4,FALSE)","v":"Model 7"}]
["Nr Startowy:",{"$f":"VLOOKUP(7,'Lista startowa F4H-P'!$A$5:$C$29,2,FALSE)","v":7}]
[null,null,null,"S:",{"$f":"G33","v":0},"L1:",{"$f":"G21","v":0},"L2:",{"$f":"K21","v":0},"L3:",{"$f":"O21","v":0},"WL:",{"$f":"B22","v":0},"W:",{"$f":"B22+G33","v":0}]
[]
[null,null,null,"I Kolejka",null,null,null,"II Kolejka",null,null,null,"III Kolejka"]
{"$rows_left_out":28}
{"sheet":"8","index":8,"n_rows":33,"n_cols":15,"rows_kept":33,"cut":false,"hidden":false,"merged":[[18,0,18,1],[19,0,19,1],[0,1,0,3],[1,1,1,3],[2,1,2,3],[11,0,11,1],[12,0,12,1],[13,0,13,1],[14,0,14,1],[15,0,15,1],[31,0,31,1],[29,0,29,1],[30,0,30,1],[25,0,25,1],[28,0,28,1],[26,0,26,1],[27,0,27,1],[17,0,17,1],[25,8,25,10],[5,7,5,10],[5,11,5,14],[24,0,24,1],[24,3,24,6],[5,3,5,6],[6,0,6,1],[7,0,7,1],[8,0,8,1],[9,0,9,1],[10,0,10,1]]}
["Nazwisko:",{"$f":"VLOOKUP(8,'Lista startowa F4H-P'!$A$5:$C$29,3,FALSE)","v":"Pilot 8"}]
["Model:",{"$f":"VLOOKUP(8,'Lista startowa F4H-P'!$A$5:$D$29,4,FALSE)","v":"Model 8"}]
["Nr Startowy:",{"$f":"VLOOKUP(8,'Lista startowa F4H-P'!$A$5:$C$29,2,FALSE)","v":8}]
[null,null,null,"S:",{"$f":"G33","v":0},"L1:",{"$f":"G21","v":0},"L2:",{"$f":"K21","v":0},"L3:",{"$f":"O21","v":0},"WL:",{"$f":"B22","v":0},"W:",{"$f":"B22+G33","v":0}]
[]
[null,null,null,"I Kolejka",null,null,null,"II Kolejka",null,null,null,"III Kolejka"]
{"$rows_left_out":28}
{"sheet":"9","index":9,"n_rows":33,"n_cols":15,"rows_kept":33,"cut":false,"hidden":false,"merged":[[0,1,0,3],[1,1,1,3],[2,1,2,3],[31,0,31,1],[5,7,5,10],[5,11,5,14],[24,0,24,1],[24,3,24,6],[5,3,5,6],[29,0,29,1],[30,0,30,1],[28,0,28,1],[25,0,25,1],[27,0,27,1],[6,0,6,1],[7,0,7,1],[8,0,8,1],[9,0,9,1],[10,0,10,1],[17,0,17,1],[26,0,26,1],[25,8,25,10],[11,0,11,1],[12,0,12,1],[13,0,13,1],[14,0,14,1],[15,0,15,1],[18,0,18,1],[19,0,19,1]]}
["Nazwisko:",{"$f":"VLOOKUP(9,'Lista startowa F4H-P'!$A$5:$C$29,3,FALSE)","v":"Pilot 9"}]
["Model:",{"$f":"VLOOKUP(9,'Lista startowa F4H-P'!$A$5:$D$29,4,FALSE)","v":"Model 9"}]
["Nr Startowy:",{"$f":"VLOOKUP(9,'Lista startowa F4H-P'!$A$5:$C$29,2,FALSE)","v":9}]
[null,null,null,"S:",{"$f":"G33","v":0},"L1:",{"$f":"G21","v":0},"L2:",{"$f":"K21","v":0},"L3:",{"$f":"O21","v":0},"WL:",{"$f":"B22","v":0},"W:",{"$f":"B22+G33","v":0}]
[]
[null,null,null,"I Kolejka",null,null,null,"II Kolejka",null,null,null,"III Kolejka"]
{"$rows_left_out":28}
{"sheet":"10","index":10,"n_rows":33,"n_cols":15,"rows_kept":33,"cut":false,"hidden":false,"merged":[[18,0,18,1],[19,0,19,1],[0,1,0,3],[1,1,1,3],[2,1,2,3],[11,0,11,1],[12,0,12,1],[13,0,13,1],[14,0,14,1],[15,0,15,1],[31,0,31,1],[29,0,29,1],[30,0,30,1],[25,0,25,1],[28,0,28,1],[26,0,26,1],[27,0,27,1],[17,0,17,1],[25,8,25,10],[5,7,5,10],[5,11,5,14],[24,0,24,1],[24,3,24,6],[5,3,5,6],[6,0,6,1],[7,0,7,1],[8,0,8,1],[9,0,9,1],[10,0,10,1]]}
["Nazwisko:",{"$f":"VLOOKUP(10,'Lista startowa F4H-P'!$A$5:$C$29,3,FALSE)","v":"Pilot 10"}]
["Model:",{"$f":"VLOOKUP(10,'Lista startowa F4H-P'!$A$5:$D$29,4,FALSE)","v":"Model 10"}]
["Nr Startowy:",{"$f":"VLOOKUP(10,'Lista startowa F4H-P'!$A$5:$C$29,2,FALSE)","v":10}]
[null,null,null,"S:",{"$f":"G33","v":0},"L1:",{"$f":"G21","v":0},"L2:",{"$f":"K21","v":0},"L3:",{"$f":"O21","v":0},"WL:",{"$f":"B22","v":0},"W:",{"$f":"B22+G33","v":0}]
[]
[null,null,null,"I Kolejka",null,null,null,"II Kolejka",null,null,null,"III Kolejka"]
{"$rows_left_out":28}
{"sheet":"11","index":11,"n_rows":33,"n_cols":15,"rows_kept":33,"cut":false,"hidden":false,"merged":[[0,1,0,3],[1,1,1,3],[2,1,2,3],[31,0,31,1],[5,7,5,10],[5,11,5,14],[24,0,24,1],[24,3,24,6],[5,3,5,6],[29,0,29,1],[30,0,30,1],[28,0,28,1],[25,0,25,1],[27,0,27,1],[6,0,6,1],[7,0,7,1],[8,0,8,1],[9,0,9,1],[10,0,10,1],[17,0,17,1],[26,0,26,1],[25,8,25,10],[11,0,11,1],[12,0,12,1],[13,0,13,1],[14,0,14,1],[15,0,15,1],[18,0,18,1],[19,0,19,1]]}
["Nazwisko:",{"$f":"VLOOKUP(11,'Lista startowa F4H-P'!$A$5:$C$29,3,FALSE)","v":"Pilot 11"}]
["Model:",{"$f":"VLOOKUP(11,'Lista startowa F4H-P'!$A$5:$D$29,4,FALSE)","v":"Model 11"}]
["Nr Startowy:",{"$f":"VLOOKUP(11,'Lista startowa F4H-P'!$A$5:$C$29,2,FALSE)","v":11}]
[null,null,null,"S:",{"$f":"G33","v":0},"L1:",{"$f":"G21","v":0},"L2:",{"$f":"K21","v":0},"L3:",{"$f":"O21","v":0},"WL:",{"$f":"B22","v":0},"W:",{"$f":"B22+G33","v":0}]
[]
[null,null,null,"I Kolejka",null,null,null,"II Kolejka",null,null,null,"III Kolejka"]
{"$rows_left_out":28}
{"sheet":"12","index":12,"n_rows":33,"n_cols":15,"rows_kept":33,"cut":false,"hidden":false,"merged":[[18,0,18,1],[19,0,19,1],[0,1,0,3],[1,1,1,3],[2,1,2,3],[11,0,11,1],[12,0,12,1],[13,0,13,1],[14,0,14,1],[15,0,15,1],[31,0,31,1],[29,0,29,1],[30,0,30,1],[25,0,25,1],[28,0,28,1],[26,0,26,1],[27,0,27,1],[17,0,17,1],[25,8,25,10],[5,7,5,10],[5,11,5,14],[24,0,24,1],[24,3,24,6],[5,3,5,6],[6,0,6,1],[7,0,7,1],[8,0,8,1],[9,0,9,1],[10,0,10,1]]}
["Nazwisko:",{"$f":"VLOOKUP(12,'Lista startowa F4H-P'!$A$5:$C$29,3,FALSE)","v":"Pilot 12"}]
["Model:",{"$f":"VLOOKUP(12,'Lista startowa F4H-P'!$A$5:$D$29,4,FALSE)","v":"Model 12"}]
["Nr Startowy:",{"$f":"VLOOKUP(12,'Lista startowa F4H-P'!$A$5:$C$29,2,FALSE)","v":12}]
[null,null,null,"S:",{"$f":"G33","v":0},"L1:",{"$f":"G21","v":0},"L2:",{"$f":"K21","v":0},"L3:",{"$f":"O21","v":0},"WL:",{"$f":"B22","v":0},"W:",{"$f":"B22+G33","v":0}]
[]
[null,null,null,"I Kolejka",null,null,null,"II Kolejka",null,null,null,"III Kolejka"]
{"$rows_left_out":28}
{"sheet":"13","index":13,"n_rows":33,"n_cols":15,"rows_kept":33,"cut":false,"hidden":false,"merged":[[0,1,0,3],[1,1,1,3],[2,1,2,3],[31,0,31,1],[5,7,5,10],[5,11,5,14],[24,0,24,1],[24,3,24,6],[5,3,5,6],[29,0,29,1],[30,0,30,1],[28,0,28,1],[25,0,25,1],[27,0,27,1],[6,0,6,1],[7,0,7,1],[8,0,8,1],[9,0,9,1],[10,0,10,1],[17,0,17,1],[26,0,26,1],[25,8,25,10],[11,0,11,1],[12,0,12,1],[13,0,13,1],[14,0,14,1],[15,0,15,1],[18,0,18,1],[19,0,19,1]]}
["Nazwisko:",{"$f":"VLOOKUP(13,'Lista startowa F4H-P'!$A$5:$C$29,3,FALSE)","v":"Pilot 13"}]
["Model:",{"$f":"VLOOKUP(13,'Lista startowa F4H-P'!$A$5:$D$29,4,FALSE)","v":"Model 13"}]
["Nr Startowy:",{"$f":"VLOOKUP(13,'Lista startowa F4H-P'!$A$5:$C$29,2,FALSE)","v":13}]
[null,null,null,"S:",{"$f":"G33","v":0},"L1:",{"$f":"G21","v":0},"L2:",{"$f":"K21","v":0},"L3:",{"$f":"O21","v":0},"WL:",{"$f":"B22","v":0},"W:",{"$f":"B22+G33","v":0}]
[]
[null,null,null,"I Kolejka",null,null,null,"II Kolejka",null,null,null,"III Kolejka"]
{"$rows_left_out":28}
{"sheet":"14","index":14,"n_rows":33,"n_cols":15,"rows_kept":33,"cut":false,"hidden":false,"merged":[[18,0,18,1],[19,0,19,1],[0,1,0,3],[1,1,1,3],[2,1,2,3],[11,0,11,1],[12,0,12,1],[13,0,13,1],[14,0,14,1],[15,0,15,1],[31,0,31,1],[29,0,29,1],[30,0,30,1],[25,0,25,1],[28,0,28,1],[26,0,26,1],[27,0,27,1],[17,0,17,1],[25,8,25,10],[5,7,5,10],[5,11,5,14],[24,0,24,1],[24,3,24,6],[5,3,5,6],[6,0,6,1],[7,0,7,1],[8,0,8,1],[9,0,9,1],[10,0,10,1]]}
["Nazwisko:",{"$f":"VLOOKUP(14,'Lista startowa F4H-P'!$A$5:$C$29,3,FALSE)","v":"Pilot 14"}]
["Model:",{"$f":"VLOOKUP(14,'Lista startowa F4H-P'!$A$5:$D$29,4,FALSE)","v":"Model 14"}]
["Nr Startowy:",{"$f":"VLOOKUP(14,'Lista startowa F4H-P'!$A$5:$C$29,2,FALSE)","v":14}]
[null,null,null,"S:",{"$f":"G33","v":0},"L1:",{"$f":"G21","v":0},"L2:",{"$f":"K21","v":0},"L3:",{"$f":"O21","v":0},"WL:",{"$f":"B22","v":0},"W:",{"$f":"B22+G33","v":0}]
[]
[null,null,null,"I Kolejka",null,null,null,"II Kolejka",null,null,null,"III Kolejka"]
{"$rows_left_out":28}
{"sheet":"15","index":15,"n_rows":33,"n_cols":15,"rows_kept":33,"cut":false,"hidden":false,"merged":[[0,1,0,3],[1,1,1,3],[2,1,2,3],[31,0,31,1],[5,7,5,10],[5,11,5,14],[24,0,24,1],[24,3,24,6],[5,3,5,6],[29,0,29,1],[30,0,30,1],[28,0,28,1],[25,0,25,1],[27,0,27,1],[6,0,6,1],[7,0,7,1],[8,0,8,1],[9,0,9,1],[10,0,10,1],[17,0,17,1],[26,0,26,1],[25,8,25,10],[11,0,11,1],[12,0,12,1],[13,0,13,1],[14,0,14,1],[15,0,15,1],[18,0,18,1],[19,0,19,1]]}
["Nazwisko:",{"$f":"VLOOKUP(15,'Lista startowa F4H-P'!$A$5:$C$29,3,FALSE)","v":"Pilot 15"}]
["Model:",{"$f":"VLOOKUP(15,'Lista startowa F4H-P'!$A$5:$D$29,4,FALSE)","v":"Model 15"}]
["Nr Startowy:",{"$f":"VLOOKUP(15,'Lista startowa F4H-P'!$A$5:$C$29,2,FALSE)","v":15}]
[null,null,null,"S:",{"$f":"G33","v":0},"L1:",{"$f":"G21","v":0},"L2:",{"$f":"K21","v":0},"L3:",{"$f":"O21","v":0},"WL:",{"$f":"B22","v":0},"W:",{"$f":"B22+G33","v":0}]
[]
[null,null,null,"I Kolejka",null,null,null,"II Kolejka",null,null,null,"III Kolejka"]
{"$rows_left_out":28}
{"sheet":"16","index":16,"n_rows":33,"n_cols":15,"rows_kept":33,"cut":false,"hidden":false,"merged":[[18,0,18,1],[19,0,19,1],[0,1,0,3],[1,1,1,3],[2,1,2,3],[11,0,11,1],[12,0,12,1],[13,0,13,1],[14,0,14,1],[15,0,15,1],[31,0,31,1],[29,0,29,1],[30,0,30,1],[25,0,25,1],[28,0,28,1],[26,0,26,1],[27,0,27,1],[17,0,17,1],[25,8,25,10],[5,7,5,10],[5,11,5,14],[24,0,24,1],[24,3,24,6],[5,3,5,6],[6,0,6,1],[7,0,7,1],[8,0,8,1],[9,0,9,1],[10,0,10,1]]}
["Nazwisko:",{"$f":"VLOOKUP(16,'Lista startowa F4H-P'!$A$5:$C$29,3,FALSE)","v":"Pilot 16"}]
["Model:",{"$f":"VLOOKUP(16,'Lista startowa F4H-P'!$A$5:$D$29,4,FALSE)","v":"Model 16"}]
["Nr Startowy:",{"$f":"VLOOKUP(16,'Lista startowa F4H-P'!$A$5:$C$29,2,FALSE)","v":16}]
[null,null,null,"S:",{"$f":"G33","v":0},"L1:",{"$f":"G21","v":0},"L2:",{"$f":"K21","v":0},"L3:",{"$f":"O21","v":0},"WL:",{"$f":"B22","v":0},"W:",{"$f":"B22+G33","v":0}]
[]
[null,null,null,"I Kolejka",null,null,null,"II Kolejka",null,null,null,"III Kolejka"]
{"$rows_left_out":28}
{"sheet":"17","index":17,"n_rows":33,"n_cols":15,"rows_kept":33,"cut":false,"hidden":false,"merged":[[0,1,0,3],[1,1,1,3],[2,1,2,3],[31,0,31,1],[5,7,5,10],[5,11,5,14],[24,0,24,1],[24,3,24,6],[5,3,5,6],[29,0,29,1],[30,0,30,1],[28,0,28,1],[25,0,25,1],[27,0,27,1],[6,0,6,1],[7,0,7,1],[8,0,8,1],[9,0,9,1],[10,0,10,1],[17,0,17,1],[26,0,26,1],[25,8,25,10],[11,0,11,1],[12,0,12,1],[13,0,13,1],[14,0,14,1],[15,0,15,1],[18,0,18,1],[19,0,19,1]]}
["Nazwisko:",{"$f":"VLOOKUP(17,'Lista startowa F4H-P'!$A$5:$C$29,3,FALSE)","v":"Pilot 17"}]
["Model:",{"$f":"VLOOKUP(17,'Lista startowa F4H-P'!$A$5:$D$29,4,FALSE)","v":"Model 17"}]
["Nr Startowy:",{"$f":"VLOOKUP(17,'Lista startowa F4H-P'!$A$5:$C$29,2,FALSE)","v":17}]
[null,null,null,"S:",{"$f":"G33","v":0},"L1:",{"$f":"G21","v":0},"L2:",{"$f":"K21","v":0},"L3:",{"$f":"O21","v":0},"WL:",{"$f":"B22","v":0},"W:",{"$f":"B22+G33","v":0}]
[]
[null,null,null,"I Kolejka",null,null,null,"II Kolejka",null,null,null,"III Kolejka"]
{"$rows_left_out":28}
{"sheet":"18","index":18,"n_rows":33,"n_cols":15,"rows_kept":33,"cut":false,"hidden":false,"merged":[[18,0,18,1],[19,0,19,1],[0,1,0,3],[1,1,1,3],[2,1,2,3],[11,0,11,1],[12,0,12,1],[13,0,13,1],[14,0,14,1],[15,0,15,1],[31,0,31,1],[29,0,29,1],[30,0,30,1],[25,0,25,1],[28,0,28,1],[26,0,26,1],[27,0,27,1],[17,0,17,1],[25,8,25,10],[5,7,5,10],[5,11,5,14],[24,0,24,1],[24,3,24,6],[5,3,5,6],[6,0,6,1],[7,0,7,1],[8,0,8,1],[9,0,9,1],[10,0,10,1]]}
["Nazwisko:",{"$f":"VLOOKUP(18,'Lista startowa F4H-P'!$A$5:$C$29,3,FALSE)","v":"Pilot 18"}]
["Model:",{"$f":"VLOOKUP(18,'Lista startowa F4H-P'!$A$5:$D$29,4,FALSE)","v":"Model 18"}]
["Nr Startowy:",{"$f":"VLOOKUP(18,'Lista startowa F4H-P'!$A$5:$C$29,2,FALSE)","v":18}]
[null,null,null,"S:",{"$f":"G33","v":0},"L1:",{"$f":"G21","v":0},"L2:",{"$f":"K21","v":0},"L3:",{"$f":"O21","v":0},"WL:",{"$f":"B22","v":0},"W:",{"$f":"B22+G33","v":0}]
[]
[null,null,null,"I Kolejka",null,null,null,"II Kolejka",null,null,null,"III Kolejka"]
{"$rows_left_out":28}
{"sheet":"19","index":19,"n_rows":33,"n_cols":15,"rows_kept":33,"cut":false,"hidden":false,"merged":[[0,1,0,3],[1,1,1,3],[2,1,2,3],[31,0,31,1],[5,7,5,10],[5,11,5,14],[24,0,24,1],[24,3,24,6],[5,3,5,6],[29,0,29,1],[30,0,30,1],[28,0,28,1],[25,0,25,1],[27,0,27,1],[6,0,6,1],[7,0,7,1],[8,0,8,1],[9,0,9,1],[10,0,10,1],[17,0,17,1],[26,0,26,1],[25,8,25,10],[11,0,11,1],[12,0,12,1],[13,0,13,1],[14,0,14,1],[15,0,15,1],[18,0,18,1],[19,0,19,1]]}
["Nazwisko:",{"$f":"VLOOKUP(19,'Lista startowa F4H-P'!$A$5:$C$29,3,FALSE)","v":"Pilot 19"}]
["Model:",{"$f":"VLOOKUP(19,'Lista startowa F4H-P'!$A$5:$D$29,4,FALSE)","v":"Model 19"}]
["Nr Startowy:",{"$f":"VLOOKUP(19,'Lista startowa F4H-P'!$A$5:$C$29,2,FALSE)","v":19}]
[null,null,null,"S:",{"$f":"G33","v":0},"L1:",{"$f":"G21","v":0},"L2:",{"$f":"K21","v":0},"L3:",{"$f":"O21","v":0},"WL:",{"$f":"B22","v":0},"W:",{"$f":"B22+G33","v":0}]
[]
[null,null,null,"I Kolejka",null,null,null,"II Kolejka",null,null,null,"III Kolejka"]
{"$rows_left_out":28}
{"sheet":"20","index":20,"n_rows":33,"n_cols":15,"rows_kept":33,"cut":false,"hidden":false,"merged":[[18,0,18,1],[19,0,19,1],[0,1,0,3],[1,1,1,3],[2,1,2,3],[11,0,11,1],[12,0,12,1],[13,0,13,1],[14,0,14,1],[15,0,15,1],[31,0,31,1],[29,0,29,1],[30,0,30,1],[25,0,25,1],[28,0,28,1],[26,0,26,1],[27,0,27,1],[17,0,17,1],[25,8,25,10],[5,7,5,10],[5,11,5,14],[24,0,24,1],[24,3,24,6],[5,3,5,6],[6,0,6,1],[7,0,7,1],[8,0,8,1],[9,0,9,1],[10,0,10,1]]}
["Nazwisko:",{"$f":"VLOOKUP(20,'Lista startowa F4H-P'!$A$5:$C$29,3,FALSE)","v":"Pilot 20"}]
["Model:",{"$f":"VLOOKUP(20,'Lista startowa F4H-P'!$A$5:$D$29,4,FALSE)","v":"Model 20"}]
["Nr Startowy:",{"$f":"VLOOKUP(20,'Lista startowa F4H-P'!$A$5:$C$29,2,FALSE)","v":20}]
[null,null,null,"S:",{"$f":"G33","v":0},"L1:",{"$f":"G21","v":0},"L2:",{"$f":"K21","v":0},"L3:",{"$f":"O21","v":0},"WL:",{"$f":"B22","v":0},"W:",{"$f":"B22+G33","v":0}]
[]
[null,null,null,"I Kolejka",null,null,null,"II Kolejka",null,null,null,"III Kolejka"]
{"$rows_left_out":28}
{"sheet":"21","index":21,"n_rows":33,"n_cols":15,"rows_kept":33,"cut":false,"hidden":false,"merged":[[0,1,0,3],[1,1,1,3],[2,1,2,3],[31,0,31,1],[5,7,5,10],[5,11,5,14],[24,0,24,1],[24,3,24,6],[5,3,5,6],[29,0,29,1],[30,0,30,1],[28,0,28,1],[25,0,25,1],[27,0,27,1],[6,0,6,1],[7,0,7,1],[8,0,8,1],[9,0,9,1],[10,0,10,1],[17,0,17,1],[26,0,26,1],[25,8,25,10],[11,0,11,1],[12,0,12,1],[13,0,13,1],[14,0,14,1],[15,0,15,1],[18,0,18,1],[19,0,19,1]]}
["Nazwisko:",{"$f":"VLOOKUP(21,'Lista startowa F4H-P'!$A$5:$C$29,3,FALSE)","v":"Pilot 21"}]
["Model:",{"$f":"VLOOKUP(21,'Lista startowa F4H-P'!$A$5:$D$29,4,FALSE)","v":"Model 21"}]
["Nr Startowy:",{"$f":"VLOOKUP(21,'Lista startowa F4H-P'!$A$5:$C$29,2,FALSE)","v":21}]
[null,null,null,"S:",{"$f":"G33","v":0},"L1:",{"$f":"G21","v":0},"L2:",{"$f":"K21","v":0},"L3:",{"$f":"O21","v":0},"WL:",{"$f":"B22","v":0},"W:",{"$f":"B22+G33","v":0}]
[]
[null,null,null,"I Kolejka",null,null,null,"II Kolejka",null,null,null,"III Kolejka"]
{"$rows_left_out":28}
{"sheet":"22","index":22,"n_rows":33,"n_cols":15,"rows_kept":33,"cut":false,"hidden":false,"merged":[[0,1,0,3],[1,1,1,3],[2,1,2,3],[17,0,17,1],[6,0,6,1],[7,0,7,1],[8,0,8,1],[9,0,9,1],[10,0,10,1],[11,0,11,1],[12,0,12,1],[13,0,13,1],[14,0,14,1],[15,0,15,1],[18,0,18,1],[31,0,31,1],[5,7,5,10],[5,11,5,14],[24,0,24,1],[24,3,24,6],[5,3,5,6],[29,0,29,1],[30,0,30,1],[28,0,28,1],[25,0,25,1],[26,0,26,1],[27,0,27,1],[25,8,25,10],[19,0,19,1]]}
["Nazwisko:",{"$f":"VLOOKUP(22,'Lista startowa F4H-P'!$A$5:$C$29,3,FALSE)","v":"Pilot 22"}]
["Model:",{"$f":"VLOOKUP(22,'Lista startowa F4H-P'!$A$5:$D$29,4,FALSE)","v":"Model 22"}]
["Nr Startowy:",{"$f":"VLOOKUP(22,'Lista startowa F4H-P'!$A$5:$C$29,2,FALSE)","v":22}]
[null,null,null,"S:",{"$f":"G33","v":0},"L1:",{"$f":"G21","v":0},"L2:",{"$f":"K21","v":0},"L3:",{"$f":"O21","v":0},"WL:",{"$f":"B22","v":0},"W:",{"$f":"B22+G33","v":0}]
[]
[null,null,null,"I Kolejka",null,null,null,"II Kolejka",null,null,null,"III Kolejka"]
{"$rows_left_out":28}
{"sheet":"23","index":23,"n_rows":33,"n_cols":15,"rows_kept":33,"cut":false,"hidden":false,"merged":[[0,1,0,3],[1,1,1,3],[2,1,2,3],[31,0,31,1],[5,7,5,10],[5,11,5,14],[24,0,24,1],[24,3,24,6],[5,3,5,6],[29,0,29,1],[30,0,30,1],[28,0,28,1],[25,0,25,1],[27,0,27,1],[6,0,6,1],[7,0,7,1],[8,0,8,1],[9,0,9,1],[10,0,10,1],[17,0,17,1],[26,0,26,1],[25,8,25,10],[11,0,11,1],[12,0,12,1],[13,0,13,1],[14,0,14,1],[15,0,15,1],[18,0,18,1],[19,0,19,1]]}
["Nazwisko:",{"$f":"VLOOKUP(23,'Lista startowa F4H-P'!$A$5:$C$29,3,FALSE)","v":"Pilot 23"}]
["Model:",{"$f":"VLOOKUP(23,'Lista startowa F4H-P'!$A$5:$D$29,4,FALSE)","v":"Model 23"}]
["Nr Startowy:",{"$f":"VLOOKUP(23,'Lista startowa F4H-P'!$A$5:$C$29,2,FALSE)","v":23}]
[null,null,null,"S:",{"$f":"G33","v":0},"L1:",{"$f":"G21","v":0},"L2:",{"$f":"K21","v":0},"L3:",{"$f":"O21","v":0},"WL:",{"$f":"B22","v":0},"W:",{"$f":"B22+G33","v":0}]
[]
[null,null,null,"I Kolejka",null,null,null,"II Kolejka",null,null,null,"III Kolejka"]
{"$rows_left_out":28}
{"sheet":"24","index":24,"n_rows":33,"n_cols":15,"rows_kept":33,"cut":false,"hidden":false,"merged":[[0,1,0,3],[1,1,1,3],[2,1,2,3],[17,0,17,1],[6,0,6,1],[7,0,7,1],[8,0,8,1],[9,0,9,1],[10,0,10,1],[11,0,11,1],[12,0,12,1],[13,0,13,1],[14,0,14,1],[15,0,15,1],[18,0,18,1],[31,0,31,1],[5,7,5,10],[5,11,5,14],[24,0,24,1],[24,3,24,6],[5,3,5,6],[29,0,29,1],[30,0,30,1],[28,0,28,1],[25,0,25,1],[26,0,26,1],[27,0,27,1],[25,8,25,10],[19,0,19,1]]}
["Nazwisko:",{"$f":"VLOOKUP(24,'Lista startowa F4H-P'!$A$5:$C$29,3,FALSE)","v":"Pilot 24"}]
["Model:",{"$f":"VLOOKUP(24,'Lista startowa F4H-P'!$A$5:$D$29,4,FALSE)","v":"Model 24"}]
["Nr Startowy:",{"$f":"VLOOKUP(24,'Lista startowa F4H-P'!$A$5:$C$29,2,FALSE)","v":24}]
[null,null,null,"S:",{"$f":"G33","v":0},"L1:",{"$f":"G21","v":0},"L2:",{"$f":"K21","v":0},"L3:",{"$f":"O21","v":0},"WL:",{"$f":"B22","v":0},"W:",{"$f":"B22+G33","v":0}]
[]
[null,null,null,"I Kolejka",null,null,null,"II Kolejka",null,null,null,"III Kolejka"]
{"$rows_left_out":28}
{"sheet":"25","index":25,"n_rows":33,"n_cols":15,"rows_kept":33,"cut":false,"hidden":false,"merged":[[0,1,0,3],[1,1,1,3],[2,1,2,3],[31,0,31,1],[5,7,5,10],[5,11,5,14],[24,0,24,1],[24,3,24,6],[5,3,5,6],[29,0,29,1],[30,0,30,1],[28,0,28,1],[25,0,25,1],[27,0,27,1],[6,0,6,1],[7,0,7,1],[8,0,8,1],[9,0,9,1],[10,0,10,1],[17,0,17,1],[26,0,26,1],[25,8,25,10],[11,0,11,1],[12,0,12,1],[13,0,13,1],[14,0,14,1],[15,0,15,1],[18,0,18,1],[19,0,19,1]]}
["Nazwisko:",{"$f":"VLOOKUP(25,'Lista startowa F4H-P'!$A$5:$C$29,3,FALSE)","v":"Pilot 25"}]
["Model:",{"$f":"VLOOKUP(25,'Lista startowa F4H-P'!$A$5:$D$29,4,FALSE)","v":"Model 25"}]
["Nr Startowy:",{"$f":"VLOOKUP(25,'Lista startowa F4H-P'!$A$5:$C$29,2,FALSE)","v":25}]
[null,null,null,"S:",{"$f":"G33","v":0},"L1:",{"$f":"G21","v":0},"L2:",{"$f":"K21","v":0},"L3:",{"$f":"O21","v":0},"WL:",{"$f":"B22","v":0},"W:",{"$f":"B22+G33","v":0}]
[]
[null,null,null,"I Kolejka",null,null,null,"II Kolejka",null,null,null,"III Kolejka"]
{"$rows_left_out":27}